  M3_35_perf
  M6a34
  R2_1_maintenance
  R362_RC2_Test
  R37_M2a
  R3_0_maintenance
  R3_1_maintenance
  R3_2_maintenance
  R3_3_1_maintenance
  R3_3_maintenance
  R3_4_maintenance
  R3_4_maintenance_patches
  R3_5_maintenance
  R3_6_1_forfoundation
  R3_6_maintenance
  R3_7_maintenance
  R3_8_eclipse
  R4_1_maintenance
  R4_2_primary
  R4_HEAD
  RC1_32_branch
  download_rework
  git_test
* master
  p2integration2
  patched_361builder
  perf_213
  perf_30
  perf_31x
  perf_32x
  perf_33x
  perf_34x
  perf_35x
  perf_36x
  perf_37x
  post_M4_fixes
  pre_restructure
  r35M6publisher_branch
  releng_kim
  releng_test
  releng_test2
  releng_test_36p2api
