I20100227-1500
I20100309
I20100309-1500
I20100310
I20100313
R0_10
R0_11
R0_9
R1_0M4
R1_0M5
Root_model_tweaking_round3
v20090101-1930
v20090108-1930
v20090113-1430
v20090123-1000
v20090203-0830
v20090203-1930
v20090204-1930
v20090212-1930
v20090226-1500
v20090305-1930
v20090311-0900
v20090311-1000
v20090312-1930
v20090317-1930
v20090401-1130
v20090402-1930
v20090409-1930
v20090507-0845
v20090521-1930
v20090528-1930
v20090605-1100
v20090609-1530
v20090610-0930
v20090612-1930
v20090615-1930
v20090616-1500
v20090619-1530
v20090622-1500
v20090624-1330
v20090626-1330
v20090629-1530
v20090630-1500
v20090706-1930
v20090707-0830
v20090707-1500
v20090710-1500
v20090712-2130
v20090714-1930
v20090716-1930
v20090717-1400
v20090722-2100
v20090724-1500
v20090726-1130
v20090728-1430
v20090903-1500
v20090909-0900
v20090923-0800
v20090923-0830
v20090923-0930
v20091009-1130
v20091009-1415
v20091015-1330
v20091016-1430
v20091022-1300
v20091029-1230
v20091105-1400
v20091110-1400
v20091112-1600
v20091115-2130
v20091116-2030
v20091116-2130
v20091118-0830
v20091118-1900
v20091119-0800
v20091119-1730
v20091126-1430
v20091126-1500
v20091203-1000
v20091204-0830
v20091210-1630
v20091217-1900
v20100104-1430
v20100106-0930
v20100106-1400
v20100108-1630
v20100111-1500
v20100112-1800
v20100113-1500
v20100113-1830
v20100114-1200
v20100114-1430
v20100114-1800
v20100114-2100
v20100121-2130
v20100129-0930
v20100204-1500
v20100205-0830
v20100211-0930
v20100218-1430
v20100304-0800
v20100304-1530
v20100308-1000
v20100315-1230
v20100316-1730
v20100317
v20100318
v20100318-1700
v20100319
v20100319b
v20100319b1
v20100321
v20100406
v20100406-0930
v20100406bis
v20100407
v20100407-2130
v20100408
v20100410
v20100416-1400
v20100417
v20100417bis
v20100422
v20100428
v20100428-1730
v20100428-2200
v20100504
v20100505-0730
v20100514-0830
v20100520-1200
v20100521
v20100521-0900
v20100522
v20100522-1900
v20100523bis
v20100525-1600
v20100526
v20100603
v20100603-1900
v20100604-1515
v20100606-1500
v20100609-2000
v20100613-1900
v20100614-1830
v20100615-2100
v20100616-1900
v20100617-2100
v20100618
v20100618bis
v20100626
v20100627-1530
v20100628-2030
v20100705-0830
v20100705-2130
v20100715-1830
v20100716-1200
v20100720-1930
v20100721-1130
v20100722
v20100722-1200
v20100722bis
v20100816-1230
v20100817-0930
v20100905
v20101021
v20101025
v20101119-0800
v20101126-1035
v20101201-1530
v20110218-0800
v20110603
v20110609-1700
