______________________________________________________________________________________________

WATERS 2019

International Workshop on Analysis Tools and Methodologies for Embedded and Real-time Systems

https://www.ecrts.org/archives/fileadmin/WebsitesArchiv/ecrts2019/waters


WATERS 2019 community forum

https://www.ecrts.org/forum/viewforum.php?f=42&sid=273e69c4b3fcb4746fe0d1dd25ca8970

______________________________________________________________________________________________

Description of the WATERS Industrial Challenge 2019

The 2019 FMTV Challenge (BOSCH)

https://www.ecrts.org/forum/viewtopic.php?f=43&t=124&sid=0ed1902afb3bc9cdc463ad4e5fbe7470

______________________________________________________________________________________________

Origin:
	Forum
	https://www.ecrts.org/forum/viewtopic.php?f=43&t=126&sid=6e0c255145af515ce5aabe92a64618db

	ChallengeModel_release_fix.zip
	https://www.ecrts.org/forum/download/file.php?id=117&sid=e70ad88e33ec8b258b8cd3274164d727
