<?xml version="1.0" encoding="utf-8"?>
<!-- Generator: Adobe Illustrator 25.4.1, SVG Export Plug-In . SVG Version: 6.00 Build 0)  -->
<svg version="1.1" xmlns="http://www.w3.org/2000/svg" xmlns:xlink="http://www.w3.org/1999/xlink" x="0px" y="0px"
	 viewBox="0 0 364 336" style="enable-background:new 0 0 364 336;" xml:space="preserve">
<style type="text/css">
	.st0{fill:none;}
</style>
<g id="Sfondo">
	<rect class="st0" width="364" height="336"/>
</g>
<g id="LOGO">
	<g>
		<rect class="st0" width="364" height="336"/>
		<g>
			<path d="M214.1,164.8c-15.7,1.8-27,15.7-25.7,31.4c19-1.8,35.9-11.1,47.4-25C230,166.3,222.2,163.8,214.1,164.8"/>
			<path d="M130.6,157.4c-1.1-9.8-8.7-17.4-18-18.9c2.2,12.2,7.5,23.3,15.1,32.5C130,167.1,131.2,162.3,130.6,157.4"/>
			<path d="M156.6,147.9l-23.7,28.8c10,9.7,22.9,16.4,37.2,18.8l17.9-21.8L156.6,147.9z"/>
			<path d="M213.9,157.7l29.3,2.7c5.7-10.1,8.9-21.8,8.9-34.3c0-4-0.4-8-1-11.8l-33-3L213.9,157.7z"/>
			<path d="M217.5,65.5c-8.9-5.3-19.1-8.6-30.1-9.5l3.1,15.1L217.5,65.5z"/>
			<path d="M249.1,105.7c-2.9-9.7-7.9-18.5-14.4-25.9l-1.2,25.1L249.1,105.7z"/>
			<path d="M168.3,95L145,66.1c-19,11.6-32,32-33.4,55.5l9.4,11.6L168.3,95z"/>
			<path d="M181.8,154.1c-15.5,0-28-12.5-28-28c0-15.5,12.5-28,28-28c15.5,0,28,12.5,28,28C209.8,141.6,197.2,154.1,181.8,154.1"/>
			<path d="M196.3,90.1c-1-9,5.4-17.1,14.4-18.2c9-1,17.1,5.4,18.2,14.4c1,9-5.4,17.1-14.4,18.2C205.5,105.5,197.3,99.1,196.3,90.1"
				/>
			<path d="M161,75.1c-0.8-6.8,4.1-13,10.9-13.8c6.8-0.8,13,4.1,13.8,10.9c0.8,6.8-4.1,13-10.9,13.8C168,86.7,161.8,81.9,161,75.1"
				/>
			<path d="M141.6,149.6c-5.2,0.6-9.8-3.1-10.4-8.3c-0.6-5.2,3.1-9.8,8.3-10.4c5.2-0.6,9.8,3.1,10.4,8.3
				C150.4,144.4,146.7,149,141.6,149.6"/>
			<path d="M279.9,224c-15.5,0-28,12.5-28,28c0,15.5,12.5,28,28,28c15.5,0,28-12.5,28-28C307.9,236.5,295.4,224,279.9,224
				 M279.9,265c-7.2,0-13-5.8-13-13c0-7.2,5.8-13,13-13c7.2,0,13,5.8,13,13C292.9,259.2,287.1,265,279.9,265"/>
			<path d="M83.9,224c-15.5,0-28,12.5-28,28c0,15.5,12.5,28,28,28c15.5,0,28-12.5,28-28C111.9,236.5,99.4,224,83.9,224 M83.9,265
				c-7.2,0-13-5.8-13-13c0-7.2,5.8-13,13-13c7.2,0,13,5.8,13,13C96.9,259.2,91.1,265,83.9,265"/>
			<path d="M158.9,227.1c-3-1.7-6.5-2.5-10.5-2.5c-3.3,0-6.4,0.6-8.9,1.9c-1.8,0.9-3.3,2-4.5,3.5v-4.3h-14.7v52.5h15.7v-30.6
				c0-2.7,0.8-4.8,2.4-6.4c1.6-1.6,3.6-2.4,6.1-2.4c2.5,0,4.5,0.8,6.1,2.4c1.6,1.6,2.4,3.7,2.4,6.4v30.6h15.7v-33.5
				c0-4-0.9-7.5-2.5-10.5C164.3,231.2,161.9,228.8,158.9,227.1z"/>
			<rect x="182.8" y="225.7" width="15.7" height="52.5"/>
			<path d="M231.8,227c-1.7,0.8-3.2,2.1-4.3,3.9v-5.1h-14.7v52.5h15.6V250c0-3.5,1-6.3,2.9-8.2c2-1.9,4.5-2.9,7.7-2.9h7.2v-13.8
				h-5.8C237.2,225.2,234.3,225.8,231.8,227z"/>
		</g>
	</g>
</g>
</svg>
