<?xml version="1.0" encoding="utf-8"?>
<!-- Generator: Adobe Illustrator 25.4.1, SVG Export Plug-In . SVG Version: 6.00 Build 0)  -->
<svg version="1.1" xmlns="http://www.w3.org/2000/svg" xmlns:xlink="http://www.w3.org/1999/xlink" x="0px" y="0px"
	 viewBox="0 0 532 252" style="enable-background:new 0 0 532 252;" xml:space="preserve">
<style type="text/css">
	.st0{display:none;}
	.st1{display:inline;}
	.st2{fill:none;}
	.st3{fill:#FFFFFF;}
</style>
<g id="Sfondo" class="st0">
	<rect class="st1" width="532" height="252"/>
</g>
<g id="LOGO">
	<g>
		<rect class="st2" width="532" height="252"/>
		<g>
			<path class="st3" d="M158.2,164.7c-15.7,1.8-27,15.7-25.7,31.3c19-1.8,35.9-11.1,47.4-25C174,166.3,166.3,163.8,158.2,164.7"/>
			<path class="st3" d="M74.7,157.4c-1.1-9.8-8.7-17.4-18-18.9c2.2,12.2,7.5,23.3,15.1,32.5C74.1,167,75.3,162.3,74.7,157.4"/>
			<path class="st3" d="M100.7,147.8L77,176.6c10,9.7,22.8,16.4,37.2,18.8l17.9-21.8L100.7,147.8z"/>
			<path class="st3" d="M158,157.7l29.3,2.7c5.7-10.1,8.9-21.8,8.9-34.3c0-4-0.4-8-1-11.8l-33-3L158,157.7z"/>
			<path class="st3" d="M161.6,65.5c-8.9-5.3-19.1-8.6-30.1-9.5l3.1,15.1L161.6,65.5z"/>
			<path class="st3" d="M193.2,105.7c-2.9-9.7-7.9-18.4-14.4-25.9l-1.2,25.1L193.2,105.7z"/>
			<path class="st3" d="M112.4,95L89.1,66.1c-18.9,11.6-31.9,32-33.4,55.5l9.4,11.6L112.4,95z"/>
			<path class="st3" d="M125.9,154.1c-15.5,0-28-12.5-28-28c0-15.5,12.5-28,28-28c15.5,0,28,12.5,28,28
				C153.9,141.5,141.3,154.1,125.9,154.1"/>
			<path class="st3" d="M140.4,90c-1-9,5.4-17.1,14.4-18.2c9-1,17.1,5.4,18.2,14.4c1,9-5.4,17.1-14.4,18.2
				C149.6,105.5,141.4,99,140.4,90"/>
			<path class="st3" d="M105.1,75c-0.8-6.8,4.1-13,10.9-13.8c6.8-0.8,13,4.1,13.8,10.9c0.8,6.8-4.1,13-10.9,13.8
				S105.9,81.8,105.1,75"/>
			<path class="st3" d="M85.7,149.6c-5.2,0.6-9.8-3.1-10.4-8.3c-0.6-5.2,3.1-9.8,8.3-10.4c5.2-0.6,9.8,3.1,10.4,8.3
				C94.5,144.3,90.8,149,85.7,149.6"/>
			<path class="st3" d="M448.3,98.1c-15.5,0-28,12.5-28,28s12.5,28,28,28c15.5,0,28-12.5,28-28S463.7,98.1,448.3,98.1 M448.3,139.1
				c-7.2,0-13-5.8-13-13c0-7.2,5.8-13,13-13c7.2,0,13,5.8,13,13C461.3,133.2,455.4,139.1,448.3,139.1"/>
			<path class="st3" d="M252.3,98.1c-15.5,0-28,12.5-28,28s12.5,28,28,28c15.5,0,28-12.5,28-28S267.8,98.1,252.3,98.1 M252.3,139.1
				c-7.2,0-13-5.8-13-13c0-7.2,5.8-13,13-13c7.2,0,13,5.8,13,13C265.3,133.2,259.5,139.1,252.3,139.1"/>
			<path class="st3" d="M327.3,101.2c-3-1.7-6.5-2.5-10.5-2.5c-3.3,0-6.3,0.6-8.9,1.9c-1.8,0.9-3.3,2-4.5,3.5v-4.3h-14.7v52.5h15.6
				v-30.5c0-2.7,0.8-4.8,2.4-6.4c1.6-1.6,3.6-2.4,6.1-2.4c2.5,0,4.5,0.8,6.1,2.4c1.6,1.6,2.4,3.7,2.4,6.4v30.5h15.6v-33.5
				c0-4-0.9-7.5-2.5-10.5C332.7,105.3,330.3,102.9,327.3,101.2z"/>
			<rect x="351.2" y="99.8" class="st3" width="15.6" height="52.5"/>
			<path class="st3" d="M400.1,101.1c-1.7,0.8-3.2,2.1-4.3,3.9v-5.1h-14.7v52.5h15.6v-28.2c0-3.5,1-6.3,2.9-8.2
				c2-1.9,4.5-2.9,7.7-2.9h7.2V99.3h-5.8C405.5,99.3,402.6,99.9,400.1,101.1z"/>
		</g>
	</g>
</g>
</svg>
