{
    "network": {
      "topology": {
        "nodes": [
          { "id": "r1", "type": "endpoint" },
          { "id": "r2", "type": "endpoint" },
          { "id": "tsn_b1", "type": "switch","processingDelay": 1},
          { "id": "tsn_b2", "type":"switch", "processingDelay": 1},
          { "id": "l1", "type": "endpoint" }
        ],
        "edges": [
          {
            "link": "lnk1",
            "nodes": ["r1", "tsn_b1"],
            "delay": 4,
            "speed": 100
          },
          {
            "link": "lnk2",
            "nodes": ["r2", "tsn_b1"],
            "delay": 4,
            "speed": 100
          }, 
          {
            "link": "lnk3",
            "nodes": ["tsn_b1", "tsn_b2"],
            "delay": 4,
            "speed": 100
          },
          {
            "link": "lnk4",
            "nodes": ["tsn_b2", "l1"],
            "delay": 4,
            "speed": 100
          }
        ]
      }
    },
    "flows": [
      {
        "flowId": "flow1",
        "deadline": 800,
        "packetSize": 11264,
        "period": 8000,
        "path": ["r1","tsn_b2","l1"]
      },
      {
        "flowId": "flow2",
        "deadline": 900,
        "packetSize": 11264,
        "period": 16000,
        "path": ["r2","tsn_b1","tsn_b2","l1"]
      }
    ]
  }
  