{
    "type": "taprio",
    "switches": [
        {
            "switch": "n2",
            "interfaces": [
                {
                    "src": "n2",
                    "dest": "hub",
                    "schedEntries": [
                        {
                            "schedEntry": 1,
                            "gatemask": "01",
                            "interval": 17000
                        },
                        {
                            "schedEntry": 2,
                            "gatemask": "02",
                            "interval": 29000
                        },
                        {
                            "schedEntry": 3,
                            "gatemask": "01",
                            "interval": 754000
                        }
                    ]
                }
            ]
        },
        {
            "switch": "hub",
            "interfaces": [
                {
                    "src": "hub",
                    "dest": "n3",
                    "schedEntries": [
                        {
                            "schedEntry": 1,
                            "gatemask": "01",
                            "interval": 35000
                        },
                        {
                            "schedEntry": 2,
                            "gatemask": "02",
                            "interval": 29000
                        },
                        {
                            "schedEntry": 3,
                            "gatemask": "01",
                            "interval": 736000
                        }
                    ]
                }
            ]
        }
    ],
    "flows": [
        {
            "flowID": "n1",
            "starts": 0,
            "arrives": 51
        },
        {
            "flowID": "n1",
            "starts": 4,
            "arrives": 64
        }
    ]
}
