module xnfrv/components/xnfv-api

go 1.22.7

replace go-common/components/utils => ../../assets/go-common/components/utils

replace xnfrv/components/xnfrv-sdk => ../xnfrv-sdk

replace xnfrv/components/xnfv-listeners => ../xnfv-listeners

require (
	github.com/gorilla/mux v1.8.1
	github.com/swaggo/http-swagger v1.3.4
	github.com/swaggo/swag v1.16.3
	go-common/components/utils v0.0.0-00010101000000-000000000000
	xnfrv/components/xnfrv-sdk v0.0.0-00010101000000-000000000000
	xnfrv/components/xnfv-listeners v0.0.0-00010101000000-000000000000
)

require (
	github.com/KyleBanks/depth v1.2.1 // indirect
	github.com/cespare/xxhash/v2 v2.2.0 // indirect
	github.com/dgryski/go-rendezvous v0.0.0-20200823014737-9f7001d12a5f // indirect
	github.com/go-openapi/jsonpointer v0.19.5 // indirect
	github.com/go-openapi/jsonreference v0.20.0 // indirect
	github.com/go-openapi/spec v0.20.6 // indirect
	github.com/go-openapi/swag v0.19.15 // indirect
	github.com/golang/protobuf v1.5.2 // indirect
	github.com/google/uuid v1.2.0 // indirect
	github.com/hibiken/asynq v0.24.1 // indirect
	github.com/joho/godotenv v1.5.1 // indirect
	github.com/josharian/intern v1.0.0 // indirect
	github.com/mailru/easyjson v0.7.6 // indirect
	github.com/op/go-logging v0.0.0-20160315200505-970db520ece7 // indirect
	github.com/opencontainers/go-digest v1.0.0 // indirect
	github.com/opencontainers/image-spec v1.1.0 // indirect
	github.com/redis/go-redis/v9 v9.0.3 // indirect
	github.com/robfig/cron/v3 v3.0.1 // indirect
	github.com/spf13/cast v1.3.1 // indirect
	github.com/swaggo/files v0.0.0-20220610200504-28940afbdbfe // indirect
	github.com/xeipuuv/gojsonpointer v0.0.0-20180127040702-4e3ac2762d5f // indirect
	github.com/xeipuuv/gojsonreference v0.0.0-20180127040603-bd5ef7bd5415 // indirect
	github.com/xeipuuv/gojsonschema v1.2.0 // indirect
	golang.org/x/net v0.17.0 // indirect
	golang.org/x/sys v0.13.0 // indirect
	golang.org/x/time v0.0.0-20190308202827-9d24e82272b4 // indirect
	golang.org/x/tools v0.7.0 // indirect
	google.golang.org/protobuf v1.26.0 // indirect
	gopkg.in/yaml.v2 v2.4.0 // indirect
)
