module go-colors

go 1.22

require (
	github.com/lucasb-eyer/go-colorful v1.2.0
	github.com/muesli/gamut v0.3.1
)

require (
	github.com/muesli/clusters v0.0.0-20200529215643-2700303c1762 // indirect
	github.com/muesli/kmeans v0.3.1 // indirect
	github.com/xrash/smetrics v0.0.0-20201216005158-039620a65673 // indirect
)
