{
  "web": {
      "keycloak_url": "https://nephele-dashboard.netmode.ntua.gr:443/",
      "realm": "nephele",
      "auth_uri": "https://nephele-dashboard.netmode.ntua.gr:443/realms/nephele/protocol/openid-connect/auth",
      "token_uri": "https://nephele-dashboard.netmode.ntua.gr:443/realms/nephele/openid-connect/token",
      "issuer": "https://nephele-dashboard.netmode.ntua.gr:443/realms/nephele",
      "userinfo_uri": "https://nephele-dashboard.netmode.ntua.gr:443/realms/nephele/protocol/openid-connect/userinfo",
      "token_introspection_uri": "https://nephele-dashboard.netmode.ntua.gr:443/realms/nephele/protocol/openid-connect/token/introspect",
      "redirect_uris": [
        "http://localhost:5000/*"
      ]
  }
}
