{
    "defaultSeverity": "error",
    "jsRules": {},
    "rules": {
        "trailing-comma": [ false ],
        "no-empty": false,
        "no-namespace": false,
        "prefer-for-of": false,
        "no-console": false,
        "radix": false,
        "quotes": ["single"]
    },
    "rulesDirectory": []
}