{
  "openapi": "3.0.1",
  "info": {
    "version": "v1.0.0",
    "title": "Logging tool, swagger endpoints",
    "description": "Logging tool, swagger endpoints"
  },
  "servers": [
    {
      "url": "http://localhost:29788",
      "description": "Logging tool, swagger endpoints"
    }
  ],
  "tags": [
    {
      "name": "Trino catalogs",
      "description": "Operations related to assets"
    },
    {
      "name": "Trino settings",
      "description": "Operations related to products"
    }
  ],
  "paths": {
    "/trinocatalog/getall": {
      "get": {
        "tags": [
          "Assets"
        ],
        "summary": "Returns all the configured trino catalogs",
        "description": "Returns all the configured trino catalogs",
        "responses": {
          "200": {
            "description": "OK"
          }
        }
      }
    },
    "/trinocatalog/getByAssetId": {
      "get": {
        "tags": [
          "Assets"
        ],
        "summary": "Get a specific asset by ID",
        "description": "",
        "parameters": [
          {
            "name": "assetId",
            "in": "query",
            "required": true,
            "schema": {
              "type": "string"
            }
          }
        ],
        "responses": {
          "200": {
            "description": "OK"
          }
        }
      }
    },
    "/assetLog/getByDate": {
      "get": {
        "tags": [
          "EDC Assets"
        ],
        "summary": "Filters the asset logs by date",
        "description": "Filters the asset logs by date",
        "parameters": [
          {
            "name": "fromDate",
            "in": "query",
            "required": true,
            "schema": {
              "type": "string"
            },
            "example": "2024-01-19T12:39:03.111Z"
          }
        ],
        "responses": {
          "200": {
            "description": "OK"
          }
        }
      }
    },
    "/assetLog/getWithFilters": {
      "get": {
        "tags": [
          "EDC Assets"
        ],
        "summary": "Filters the asset logs by the below fields, empty the values from fields not desired, each filter is applied with and operator",
        "description": "Filters the asset logs by the below fields, empty the values from fields not desired, each filter is applied with and operator",
        "parameters": [
          {
            "name": "providerId",
            "in": "query",
            "required": false,
            "schema": {
              "type": "string"
            },
            "example": "bad443d1-48dd-4efe-986b-ef915cfe3294"
          },
          {
            "name": "providerName",
            "in": "query",
            "required": false,
            "schema": {
              "type": "string"
            },
            "example": "demo company"
          },
          {
            "name": "assetId",
            "in": "query",
            "required": false,
            "schema": {
              "type": "string"
            },
            "description": "Filters the asset logs by asset Id",
            "example": "test_asset_id"
          },
          {
            "name": "assetName",
            "in": "query",
            "required": false,
            "schema": {
              "type": "string"
            },
            "description": "Filters the asset logs by asset name",
            "example": "asset name"
          },
          {
            "name": "action",
            "in": "query",
            "required": false,
            "schema": {
              "type": "string"
            },
            "description": "Filters the asset logs by action (actions = create,update,delete,transfer) etc by using action=transfer returning only the logs about an asset or assets that were transfered by a consumer",
            "example": "transfer"
          }
        ],
        "responses": {
          "200": {
            "description": "OK"
          }
        }
      }
    },
    "/assetLog/create": {
      "post": {
        "tags": [
          "Assets"
        ],
        "summary": "To log information on the creation of an asset",
        "description": "To log information on the creation of an asset",
        "responses": {
          "200": {
            "description": "OK"
          },
          "404": {
            "description": "Not Found"
          }
        },
        "requestBody": {
          "content": {
            "application/json": {
              "schema": {
                "type": "object",
                "properties": {
                  "assetId": {
                    "example": "test_asset_id"
                  },
                  "assetName": {
                    "example": "asset name"
                  },
                  "contentType": {
                    "example": "application/json"
                  },
                  "version": {
                    "example": "1.0"
                  },
                  "container": {
                    "example": "src-container"
                  },
                  "blobName": {
                    "example": "Blob Name"
                  },
                  "accountName": {
                    "example": "object storage account name"
                  },
                  "endpointUsed": {
                    "example": "http://datamiteassetservice/asset/create"
                  },
                  "ipAddress": {
                    "example": "10.60.75.52"
                  },
                  "isDeleted": {
                    "example": false
                  },
                  "providerId": {
                    "example": "bad443d1-48dd-4efe-986b-ef915cfe3294"
                  },
                  "providerName": {
                    "example": "demo company"
                  },
                  "userName": {
                    "example": "geonikolai"
                  },
                  "userId": {
                    "example": "dc57d527-0964-4146-8c4b-e50a526759fc"
                  },
                  "createdAt": {
                    "example": "2024-01-19T12:39:03.111Z"
                  }
                }
              }
            }
          }
        }
      }
    },
    "/assetLog/update": {
      "post": {
        "tags": [
          "Assets"
        ],
        "summary": "To log information on the update of an asset",
        "description": "To log information on the update of an asset",
        "responses": {
          "200": {
            "description": "OK"
          },
          "404": {
            "description": "Not Found"
          }
        },
        "requestBody": {
          "content": {
            "application/json": {
              "schema": {
                "type": "object",
                "properties": {
                  "assetId": {
                    "example": "350ba92e-7658-4816-b6f6-579529d1cc7f"
                  },
                  "assetName": {
                    "example": "asset name"
                  },
                  "contentType": {
                    "example": "application/json"
                  },
                  "version": {
                    "example": "1.0"
                  },
                  "container": {
                    "example": "src-container"
                  },
                  "blobName": {
                    "example": "Blob Name"
                  },
                  "accountName": {
                    "example": "object storage account name"
                  },
                  "ipAddress": {
                    "example": "10.60.75.52"
                  },
                  "endpointUsed": {
                    "example": "http://datamiteassetservice/asset/create"
                  },
                  "isDeleted": {
                    "example": false
                  },
                  "providerId": {
                    "example": "bad443d1-48dd-4efe-986b-ef915cfe3294"
                  },
                  "providerName": {
                    "example": "demo company"
                  },
                  "userName": {
                    "example": "geonikolai"
                  },
                  "userId": {
                    "example": "dc57d527-0964-4146-8c4b-e50a526759fc"
                  },
                  "createdAt": {
                    "example": "2024-01-19T12:39:03.111Z"
                  }
                }
              }
            }
          }
        }
      }
    },
    "/assetLog/delete": {
      "post": {
        "tags": [
          "Assets"
        ],
        "summary": "To log information on the delete of an asset",
        "description": "To log information on the delete of an asset",
        "responses": {
          "200": {
            "description": "OK"
          },
          "404": {
            "description": "Not Found"
          }
        },
        "requestBody": {
          "content": {
            "application/json": {
              "schema": {
                "type": "object",
                "properties": {
                  "assetId": {
                    "example": "350ba92e-7658-4816-b6f6-579529d1cc7f"
                  },
                  "assetName": {
                    "example": "asset name"
                  },
                  "contentType": {
                    "example": "application/json"
                  },
                  "version": {
                    "example": "1.0"
                  },
                  "container": {
                    "example": "src-container"
                  },
                  "blobName": {
                    "example": "Blob Name"
                  },
                  "accountName": {
                    "example": "object storage account name"
                  },
                  "ipAddress": {
                    "example": "10.60.75.52"
                  },
                  "endpointUsed": {
                    "example": "http://datamiteassetservice/asset/create"
                  },
                  "isDeleted": {
                    "example": false
                  },
                  "providerId": {
                    "example": "bad443d1-48dd-4efe-986b-ef915cfe3294"
                  },
                  "userId": {
                    "example": "dc57d527-0964-4146-8c4b-e50a526759fc"
                  },
                  "providerName": {
                    "example": "demo_company"
                  },
                  "userName": {
                    "example": "geonikolai"
                  },
                  "createdAt": {
                    "example": "2024-01-19T12:39:03.111Z"
                  }
                }
              }
            }
          }
        }
      }
    },
    "/assetLog/transfer": {
      "post": {
        "tags": [
          "Assets"
        ],
        "summary": "To log information when an asset is transfered ",
        "description": "To log information when an asset is transfered ",
        "responses": {
          "200": {
            "description": "OK"
          },
          "404": {
            "description": "Not Found"
          }
        },
        "requestBody": {
          "content": {
            "application/json": {
              "schema": {
                "type": "object",
                "properties": {
                  "transferId": {
                    "example": "69143e4b-f857-4bab-a8c8-d8d3dd99a874"
                  },
                  "assetId": {
                    "example": "test_asset_id"
                  },
                  "assetName": {
                    "example": "test_asset"
                  },
                  "policyId": {
                    "example": "onlu-eu-policy"
                  },
                  "contractId": {
                    "example": "69143e4b-f857-4bab-a8c8-d8d3dd99ae39"
                  },
                  "endpointUsed": {
                    "example": "http://datamiteassetservice/asset/create"
                  },
                  "isDeleted": {
                    "example": false
                  },
                  "providerId": {
                    "example": "bad443d1-48dd-4efe-986b-ef915cfe3294"
                  },
                  "providerName": {
                    "example": "test_company"
                  },
                  "consumerId": {
                    "example": "bad443d1-48dd-4efe-986b-ef915cfe3294"
                  },
                  "consumerName": {
                    "example": "consumer"
                  },
                  "userId": {
                    "example": "dc57d527-0964-4146-8c4b-e50a526759fc"
                  },
                  "userName": {
                    "example": "geonikolai"
                  },
                  "createdAt": {
                    "example": "2024-03-19T12:39:03.111Z"
                  }
                }
              }
            }
          }
        }
      }
    },
    "/assetLog/publish": {
      "post": {
        "tags": [
          "Assets"
        ],
        "summary": "To log information when an asset is published  ",
        "description": "To log information when an asset is published ",
        "responses": {
          "200": {
            "description": "OK"
          },
          "404": {
            "description": "Not Found"
          }
        },
        "requestBody": {
          "content": {
            "application/json": {
              "schema": {
                "type": "object",
                "properties": {
                  "assetId": {
                    "example": "test_asset_id"
                  },
                  "assetName": {
                    "example": "test_asset"
                  },
                  "policyId": {
                    "example": "onlu-eu-policy"
                  },
                  "contractId": {
                    "example": "69143e4b-f857-4bab-a8c8-d8d3dd99ae39"
                  },
                  "endpointUsed": {
                    "example": "http://datamiteassetservice/asset/create"
                  },
                  "isDeleted": {
                    "example": false
                  },
                  "providerName": {
                    "example": "test_company"
                  },
                  "providerId": {
                    "example": "bad443d1-48dd-4efe-986b-ef915cfe3294"
                  },
                  "ipAddress": {
                    "example": "10.60.75.52"
                  },
                  "userId": {
                    "example": "dc57d527-0964-4146-8c4b-e50a526759fc"
                  },
                  "userName": {
                    "example": "geonikolai"
                  },
                  "createdAt": {
                    "example": "2024-01-19T12:39:03.111Z"
                  }
                }
              }
            }
          }
        }
      }
    },
    "/policyLog/getall": {
      "get": {
        "tags": [
          "Policies"
        ],
        "summary": "Returns all the logs about policies ",
        "description": "Returns all the logs about policies",
        "responses": {
          "200": {
            "description": "OK"
          }
        }
      }
    },
    "/policyLog/getByPolicyId": {
      "get": {
        "tags": [
          "Policies"
        ],
        "summary": "Get a specific policy by ID ",
        "description": "Get a specific policy by ID",
        "parameters": [
          {
            "name": "policyId",
            "in": "path",
            "required": true,
            "schema": {
              "type": "string"
            }
          }
        ],
        "responses": {
          "200": {
            "description": "OK"
          }
        }
      }
    },
    "/policyLog/getByDate": {
      "get": {
        "tags": [
          "Policies"
        ],
        "summary": "Filters the policy logs by date ",
        "description": "Filters the policy logs by date",
        "parameters": [
          {
            "name": "fromDate",
            "in": "path",
            "required": true,
            "schema": {
              "type": "string"
            },
            "example": "2024-01-19T12:39:03.111Z"
          }
        ],
        "responses": {
          "200": {
            "description": "OK"
          }
        }
      }
    },
    "/policyLog/create": {
      "post": {
        "tags": [
          "Policies"
        ],
        "summary": "To log information on the creation of a policy ",
        "description": "To log information on the creation of a policy",
        "responses": {
          "200": {
            "description": "OK"
          },
          "404": {
            "description": "Not Found"
          }
        },
        "requestBody": {
          "content": {
            "application/json": {
              "schema": {
                "type": "object",
                "properties": {
                  "policyId": {
                    "description": "The policy id",
                    "schema": {
                      "type": "string"
                    },
                    "example": "only-eu"
                  },
                  "obligations": {
                    "example": [
                      {
                        "edctype": "AtomicConstraint",
                        "leftExpression": {
                          "edctype": "dataspaceconnector:literalexpression",
                          "value": "ids:absoluteSpatialPosition"
                        },
                        "rightExpression": {
                          "edctype": "dataspaceconnector:literalexpression",
                          "value": "eu"
                        },
                        "operator": "EQ"
                      }
                    ]
                  },
                  "prohibitions": {
                    "example": [
                      {
                        "edctype": "AtomicConstraint",
                        "leftExpression": {
                          "edctype": "dataspaceconnector:literalexpression",
                          "value": "ids:absoluteSpatialPosition"
                        },
                        "rightExpression": {
                          "edctype": "dataspaceconnector:literalexpression",
                          "value": "eu"
                        },
                        "operator": "EQ"
                      }
                    ]
                  },
                  "permissions": {
                    "example": [
                      {
                        "edctype": "AtomicConstraint",
                        "leftExpression": {
                          "edctype": "dataspaceconnector:literalexpression",
                          "value": "ids:absoluteSpatialPosition"
                        },
                        "rightExpression": {
                          "edctype": "dataspaceconnector:literalexpression",
                          "value": "eu"
                        },
                        "operator": "EQ"
                      }
                    ]
                  },
                  "assigner": {
                    "example": "assigner"
                  },
                  "assignee": {
                    "example": "assignee"
                  },
                  "assetId": {
                    "example": "350ba92e-7658-4816-b6f6-579529d1cc7f"
                  },
                  "assetName": {
                    "example": "asset name"
                  },
                  "endpointUsed": {
                    "example": "http://datamiteassetservice/policy/create"
                  },
                  "isDeleted": {
                    "example": false
                  },
                  "providerId": {
                    "example": "bad443d1-48dd-4efe-986b-ef915cfe3294"
                  },
                  "providerName": {
                    "example": "bad443d1-48dd-4efe-986b-ef915cfe3294"
                  },
                  "userName": {
                    "example": "geonikolai"
                  },
                  "userId": {
                    "example": "dc57d527-0964-4146-8c4b-e50a526759fc"
                  },
                  "ipAddress": {
                    "example": "10.60.75.52"
                  },
                  "createdAt": {
                    "example": "2024-01-19T12:39:03.111Z"
                  }
                }
              }
            }
          }
        }
      }
    },
    "/policyLog/update": {
      "post": {
        "tags": [
          "Policies"
        ],
        "summary": "To log information on the update of a policy ",
        "description": "To log information on the update of a policy",
        "responses": {
          "200": {
            "description": "OK"
          },
          "404": {
            "description": "Not Found"
          }
        },
        "requestBody": {
          "content": {
            "application/json": {
              "schema": {
                "type": "object",
                "properties": {
                  "policyId": {
                    "description": "The policy id",
                    "schema": {
                      "type": "string"
                    },
                    "example": "only-eu"
                  },
                  "obligations": {
                    "example": []
                  },
                  "prohibitions": {
                    "example": []
                  },
                  "permissions": {
                    "example": []
                  },
                  "assetId": {
                    "example": "350ba92e-7658-4816-b6f6-579529d1cc7f"
                  },
                  "assetName": {
                    "example": "test_asset"
                  },
                  "assigner": {
                    "example": "assigner"
                  },
                  "assignee": {
                    "example": "assignee"
                  },
                  "endpointUsed": {
                    "example": "http://datamiteassetservice/policy/create"
                  },
                  "isDeleted": {
                    "example": false
                  },
                  "providerId": {
                    "example": "bad443d1-48dd-4efe-986b-ef915cfe3294"
                  },
                  "providerName": {
                    "example": "test_company"
                  },
                  "userId": {
                    "example": "dc57d527-0964-4146-8c4b-e50a526759fc"
                  },
                  "userName": {
                    "example": "geonikolai"
                  },
                  "ipAddress": {
                    "example": "10.60.75.52"
                  },
                  "createdAt": {
                    "example": "2024-07-19T12:39:03.111Z"
                  }
                }
              }
            }
          }
        }
      }
    },
    "/policyLog/delete": {
      "post": {
        "tags": [
          "Policies"
        ],
        "summary": "To log information on the delete of a policy ",
        "description": "To log information on the delete of a policy",
        "responses": {
          "200": {
            "description": "OK"
          },
          "404": {
            "description": "Not Found"
          }
        },
        "requestBody": {
          "content": {
            "application/json": {
              "schema": {
                "type": "object",
                "properties": {
                  "policyId": {
                    "description": "The policy id",
                    "schema": {
                      "type": "string"
                    },
                    "example": "only-eu"
                  },
                  "obligations": {
                    "example": []
                  },
                  "prohibitions": {
                    "example": []
                  },
                  "permissions": {
                    "example": []
                  },
                  "assigner": {
                    "example": "assigner"
                  },
                  "assignee": {
                    "example": "assignee"
                  },
                  "endpointUsed": {
                    "example": "http://datamiteassetservice/policy/delete"
                  },
                  "isDeleted": {
                    "example": false
                  },
                  "providerId": {
                    "example": "bad443d1-48dd-4efe-986b-ef915cfe3294"
                  },
                  "providerName": {
                    "example": "demo_company"
                  },
                  "ipAddress": {
                    "example": "10.60.75.52"
                  },
                  "userId": {
                    "example": "dc57d527-0964-4146-8c4b-e50a526759fc"
                  },
                  "userName": {
                    "example": "geonikolai"
                  },
                  "createdAt": {
                    "example": "2024-01-19T12:39:03.111Z"
                  }
                }
              }
            }
          }
        }
      }
    },
    "/contractLog/create": {
      "post": {
        "tags": [
          "Contracts"
        ],
        "summary": "To log information on the creation of a contract agreement",
        "description": "To log information on the creation of a contract agreement",
        "responses": {
          "200": {
            "description": "OK"
          },
          "404": {
            "description": "Not Found"
          }
        },
        "requestBody": {
          "content": {
            "application/json": {
              "schema": {
                "type": "object",
                "properties": {
                  "contractId": {
                    "description": "The contract id",
                    "schema": {
                      "type": "string"
                    },
                    "example": "999ba92e-7658-4816-b6f6-579529d1ccvc"
                  },
                  "assetId": {
                    "example": "350ba92e-7658-4816-b6f6-579529d1cc7f"
                  },
                  "assetName": {
                    "example": "test_asset"
                  },
                  "contractPolicyId": {
                    "example": "350ba92e-7658-4816-b6f6-579529d1cc7f"
                  },
                  "assetPolicyId": {
                    "example": "444ba92e-7658-4816-b6f6-579529d1888"
                  },
                  "endpointUsed": {
                    "example": "http://datamiteassetservice/contract/create"
                  },
                  "isDeleted": {
                    "example": false
                  },
                  "providerId": {
                    "example": "bad443d1-48dd-4efe-986b-ef915cfe3294"
                  },
                  "providerName": {
                    "example": "test_company"
                  },
                  "ipAddress": {
                    "example": "10.60.75.52"
                  },
                  "userId": {
                    "example": "dc57d527-0964-4146-8c4b-e50a526759fc"
                  },
                  "userName": {
                    "example": "geonikolai"
                  },
                  "createdAt": {
                    "example": "2024-04-19T12:39:03.111Z"
                  },
                  "validFromDate": {
                    "example": "2024-03-19T12:39:03.111Z"
                  },
                  "validToDate": {
                    "example": "2024-09-22T12:39:03.111Z"
                  }
                }
              }
            }
          }
        }
      }
    },
    "/contractLog/update": {
      "post": {
        "tags": [
          "Contracts"
        ],
        "summary": "To log information on the update of a contract agreement",
        "description": "To log information on the update of a contract agreement",
        "responses": {
          "200": {
            "description": "OK"
          },
          "404": {
            "description": "Not Found"
          }
        },
        "requestBody": {
          "content": {
            "application/json": {
              "schema": {
                "type": "object",
                "properties": {
                  "contractId": {
                    "description": "The contract id",
                    "schema": {
                      "type": "string"
                    },
                    "example": "999ba92e-7658-4816-b6f6-579529d1ccvc"
                  },
                  "assetId": {
                    "example": "350ba92e-7658-4816-b6f6-579529d1cc7f"
                  },
                  "assetName": {
                    "example": "test_asset"
                  },
                  "contractPolicyId": {
                    "example": "350ba92e-7658-4816-b6f6-579529d1cc7f"
                  },
                  "assetPolicyId": {
                    "example": "444ba92e-7658-4816-b6f6-579529d1888"
                  },
                  "endpointUsed": {
                    "example": "http://datamiteassetservice/contract/create"
                  },
                  "isDeleted": {
                    "example": false
                  },
                  "providerId": {
                    "example": "bad443d1-48dd-4efe-986b-ef915cfe3294"
                  },
                  "providerName": {
                    "example": "test_company"
                  },
                  "ipAddress": {
                    "example": "10.60.75.52"
                  },
                  "userId": {
                    "example": "dc57d527-0964-4146-8c4b-e50a526759fc"
                  },
                  "userName": {
                    "example": "geonikolai"
                  },
                  "createdAt": {
                    "example": "2024-01-19T12:39:03.111Z"
                  },
                  "validFromDate": {
                    "example": "2024-03-19T12:39:03.111Z"
                  },
                  "validToDate": {
                    "example": "2024-04-22T12:39:03.111Z"
                  }
                }
              }
            }
          }
        }
      }
    },
    "/contractLog/delete": {
      "post": {
        "tags": [
          "Contracts"
        ],
        "summary": "To log information on the delete of a contract agreement",
        "description": "To log information on the delete of a contract agreement",
        "responses": {
          "200": {
            "description": "OK"
          },
          "404": {
            "description": "Not Found"
          }
        },
        "requestBody": {
          "content": {
            "application/json": {
              "schema": {
                "type": "object",
                "properties": {
                  "contractId": {
                    "description": "The contract id",
                    "schema": {
                      "type": "string"
                    },
                    "example": "999ba92e-7658-4816-b6f6-579529d1ccvc"
                  },
                  "assetId": {
                    "example": "350ba92e-7658-4816-b6f6-579529d1cc7f"
                  },
                  "assetName": {
                    "example": "test_asset"
                  },
                  "contractPolicyId": {
                    "example": "350ba92e-7658-4816-b6f6-579529d1cc7f"
                  },
                  "assetPolicyId": {
                    "example": "444ba92e-7658-4816-b6f6-579529d1888"
                  },
                  "endpointUsed": {
                    "example": "http://datamiteassetservice/contract/create"
                  },
                  "isDeleted": {
                    "example": false
                  },
                  "providerId": {
                    "example": "bad443d1-48dd-4efe-986b-ef915cfe3294"
                  },
                  "providerName": {
                    "example": "test_company"
                  },
                  "ipAddress": {
                    "example": "10.60.75.52"
                  },
                  "userId": {
                    "example": "dc57d527-0964-4146-8c4b-e50a526759fc"
                  },
                  "userName": {
                    "example": "geonikolai"
                  },
                  "createdAt": {
                    "example": "2024-01-19T12:39:03.111Z"
                  },
                  "validFromDate": {
                    "example": "2024-03-19T12:39:03.111Z"
                  },
                  "validToDate": {
                    "example": "2024-04-22T12:39:03.111Z"
                  }
                }
              }
            }
          }
        }
      }
    },
    "/contractLog/acceptNegotiate": {
      "post": {
        "tags": [
          "Contracts"
        ],
        "summary": "To log information on the accept negotiate of a contract agreement",
        "description": "To log information on the accept negotiate of a contract agreement",
        "responses": {
          "200": {
            "description": "OK"
          },
          "404": {
            "description": "Not Found"
          }
        },
        "requestBody": {
          "content": {
            "application/json": {
              "schema": {
                "type": "object",
                "properties": {
                  "contractId": {
                    "description": "The contract id",
                    "schema": {
                      "type": "string"
                    },
                    "example": "999ba92e-7658-4816-b6f6-579529d1ccvc"
                  },
                  "cοnsumerId": {
                    "example": "350ba92e-7658-4816-b6f6-579529d1cc7f"
                  },
                  "cοnsumerName": {
                    "example": "cοnsumer_Name"
                  },
                  "assetId": {
                    "example": "stest_asset_id"
                  },
                  "assetName": {
                    "example": "test_asset"
                  },
                  "contractPolicyId": {
                    "example": "350ba92e-7658-4816-b6f6-579529d1cc7f"
                  },
                  "assetPolicyId": {
                    "example": "444ba92e-7658-4816-b6f6-579529d1888"
                  },
                  "endpointUsed": {
                    "example": "http://datamiteassetservice/contract/negotiate"
                  },
                  "isDeleted": {
                    "example": false
                  },
                  "providerId": {
                    "example": "bad443d1-48dd-4efe-986b-ef915cfe3294"
                  },
                  "providerName": {
                    "example": "test_company"
                  },
                  "ipAddress": {
                    "example": "10.60.75.52"
                  },
                  "userId": {
                    "example": "dc57d527-0964-4146-8c4b-e50a526759fc"
                  },
                  "userName": {
                    "example": "geonikolai"
                  },
                  "createdAt": {
                    "example": "2024-01-19T12:39:03.111Z"
                  },
                  "validFromDate": {
                    "example": "2024-03-19T12:39:03.111Z"
                  },
                  "validToDate": {
                    "example": "2024-10-22T12:39:03.111Z"
                  }
                }
              }
            }
          }
        }
      }
    },
    "/contractLog/rejectNegotiate": {
      "post": {
        "tags": [
          "Contracts"
        ],
        "summary": "To log information on the rejection of a contract agreement",
        "description": "To log information on the rejection of a contract agreement",
        "responses": {
          "200": {
            "description": "OK"
          },
          "404": {
            "description": "Not Found"
          }
        },
        "requestBody": {
          "content": {
            "application/json": {
              "schema": {
                "type": "object",
                "properties": {
                  "contractId": {
                    "description": "The contract id",
                    "schema": {
                      "type": "string"
                    },
                    "example": "999ba92e-7658-4816-b6f6-579529d1ccvc"
                  },
                  "cοnsumerId": {
                    "example": "350ba92e-7658-4816-b6f6-579529d1cc7f"
                  },
                  "cοnsumerName": {
                    "example": "cοnsumer_Name"
                  },
                  "assetId": {
                    "example": "test_asset_id"
                  },
                  "assetName": {
                    "example": "test_asset"
                  },
                  "contractPolicyId": {
                    "example": "350ba92e-7658-4816-b6f6-579529d1cc7f"
                  },
                  "assetPolicyId": {
                    "example": "444ba92e-7658-4816-b6f6-579529d1888"
                  },
                  "endpointUsed": {
                    "example": "http://datamiteassetservice/contract/negotiate"
                  },
                  "providerId": {
                    "example": "bad443d1-48dd-4efe-986b-ef915cfe3294"
                  },
                  "providerName": {
                    "example": "test_company"
                  },
                  "ipAddress": {
                    "example": "10.60.75.52"
                  },
                  "userId": {
                    "example": "dc57d527-0964-4146-8c4b-e50a526759fc"
                  },
                  "userName": {
                    "example": "geonikolai"
                  },
                  "createdAt": {
                    "example": "2024-01-19T12:39:03.111Z"
                  },
                  "validFromDate": {
                    "example": "2024-03-19T12:39:03.111Z"
                  },
                  "validToDate": {
                    "example": "2024-10-22T12:39:03.111Z"
                  }
                }
              }
            }
          }
        }
      }
    },
    "/contractLog/getWithFilters": {
      "get": {
        "tags": [
          "Contracts"
        ],
        "summary": "Filters the asset logs by the below fields, empty the values from fields not desired, each filter is applied with and operator",
        "description": "Filters the asset logs by the below fields, empty the values from fields not desired, each filter is applied with and operator",
        "parameters": [
          {
            "name": "providerId",
            "in": "query",
            "required": false,
            "schema": {
              "type": "string"
            },
            "example": "bad443d1-48dd-4efe-986b-ef915cfe3294"
          },
          {
            "name": "providerName",
            "in": "query",
            "required": false,
            "schema": {
              "type": "string"
            },
            "example": "demo company"
          },
          {
            "name": "assetId",
            "in": "query",
            "required": false,
            "schema": {
              "type": "string"
            },
            "description": "Filters the asset logs by asset Id",
            "example": "test_asset_id"
          },
          {
            "name": "assetName",
            "in": "query",
            "required": false,
            "schema": {
              "type": "string"
            },
            "description": "Filters the asset logs by asset name",
            "example": "asset name"
          },
          {
            "name": "action",
            "in": "query",
            "required": false,
            "schema": {
              "type": "string"
            },
            "description": "Filters the asset logs by action (actions = create,update,delete,transfer) etc by using action=transfer returning only the logs about an asset or assets that were transfered by a consumer",
            "example": "transfer"
          }
        ],
        "responses": {
          "200": {
            "description": "OK"
          }
        }
      }
    },
    "/metadataLog/publish": {
      "post": {
        "tags": [
          "Metadata"
        ],
        "summary": "To log information when an metadata are published",
        "description": "To log information when an metadata are published ",
        "responses": {
          "200": {
            "description": "OK"
          },
          "404": {
            "description": "Not Found"
          }
        },
        "requestBody": {
          "content": {
            "application/json": {
              "schema": {
                "type": "object",
                "properties": {
                  "endpointUsed": {
                    "example": "http://datamiteassetservice/metadata/publish"
                  },
                  "catalogId": {
                    "example": "bad443d1-48dd-4efe-986b-ef915cfe3294"
                  },
                  "catalogName": {
                    "example": "weather_catalog"
                  },
                  "providerId": {
                    "example": "bad443d1-48dd-4efe-986b-ef915cfe3294"
                  },
                  "providerName": {
                    "example": "test_company"
                  },
                  "userToken": {
                    "example": "user_token"
                  },
                  "userId": {
                    "example": "dc57d527-0964-4146-8c4b-e50a526759fc"
                  },
                  "userName": {
                    "example": "geonikolai"
                  },
                  "createdAt": {
                    "example": "2024-03-19T12:39:03.111Z"
                  },
                  "datasets": {
                    "example": [
                      {
                        "platform": "example",
                        "platform_resource_identifier": "1",
                        "name": "The name of this resource",
                        "status": "",
                        "date_published": "2022-01-01T15:15:00.000",
                        "same_as": "https://www.example.com/resource/this_resource",
                        "is_accessible_for_free": true,
                        "version": "1.1.0",
                        "issn": "20493630",
                        "measurement_technique": "mass spectrometry",
                        "temporal_coverage": "2011/2012",
                        "ai_asset_identifier": 0,
                        "ai_resource_identifier": 0,
                        "aiod_entry": {
                          "editor": [],
                          "status": "published",
                          "date_modified": "2023-01-01T15:15:00.000",
                          "date_created": "2022-01-01T15:15:00.000"
                        },
                        "alternate_name": [
                          "alias 1",
                          "alias 2"
                        ],
                        "application_area": [
                          "Fraud Prevention",
                          "Voice Assistance",
                          "Disease Classification"
                        ],
                        "citation": [],
                        "contact": [],
                        "creator": [],
                        "description": {
                          "plain": "Plain text.",
                          "html": "<p>Text with <strong>html formatting</strong>.</p>"
                        },
                        "distribution": [],
                        "funder": [],
                        "has_part": [],
                        "industrial_sector": [
                          "Finance",
                          "eCommerce",
                          "Healthcare"
                        ],
                        "is_part_of": [],
                        "keyword": [
                          "keyword1",
                          "keyword2"
                        ],
                        "license": "https://creativecommons.org/share-your-work/public-domain/cc0/",
                        "media": [],
                        "note": [],
                        "relevant_link": [
                          "https://www.example.com/a_relevant_link",
                          "https://www.example.com/another_relevant_link"
                        ],
                        "relevant_resource": [],
                        "relevant_to": [],
                        "research_area": [
                          "Explainable AI",
                          "Physical AI"
                        ],
                        "scientific_domain": [
                          "Anomaly Detection",
                          "Voice Recognition",
                          "Computer Vision."
                        ],
                        "size": {
                          "unit": "Rows",
                          "value": 100
                        },
                        "spatial_coverage": {
                          "address": {
                            "region": "California",
                            "locality": "Paris",
                            "street": "Wetstraat 170",
                            "postal_code": "1040 AA",
                            "address": "Wetstraat 170, 1040 Brussel",
                            "country": "BEL"
                          },
                          "geo": {
                            "latitude": 37.42242,
                            "longitude": -122.08585,
                            "elevation_millimeters": 0
                          }
                        },
                        "identifier": 0
                      }
                    ]
                  }
                }
              }
            }
          }
        }
      }
    },
    "/metadataLog/getall": {
      "get": {
        "tags": [
          "Metadata"
        ],
        "summary": "Returns all the logs about metadata",
        "description": "Returns all the logs about metadata",
        "responses": {
          "200": {
            "description": "OK"
          }
        }
      }
    },
    "/metadataLog/getByDate": {
      "get": {
        "tags": [
          "Metadata"
        ],
        "summary": "Returns all the logs about metadata",
        "description": "Filters the metadata logs by date",
        "parameters": [
          {
            "name": "fromDate",
            "in": "path",
            "required": true,
            "schema": {
              "type": "string"
            },
            "example": "2024-01-19T12:39:03.111Z"
          }
        ],
        "responses": {
          "200": {
            "description": "OK"
          }
        }
      }
    }
  },
  "components": {
    "securitySchemes": {
      "bearerAuth": {
        "type": "http",
        "scheme": "bearer"
      }
    }
  }
}