@startuml States_Applications
/'
SPDX-FileCopyrightText: 2023 Siemens AG
SPDX-License-Identifier: CC-BY-SA-4.0
'/
title Application states

[*] --> Waiting : Application created
Waiting --> Scheduling : ApplicationGroup says: create pods

Scheduling --> Pending : some pods pending, none failed

Pending --> Running : all pods running or succeeded
Pending --> Waiting : all pods terminated
Pending --> Failing : pod or stream failed

Failing: Cancel the other running pods if any.
Failing --> Waiting : all pods terminated

Running --> Failing : pod or stream failed
Running --> Waiting : all pods terminated

@enduml