<?xml version="1.0" encoding="UTF-8"?><svg xmlns="http://www.w3.org/2000/svg" xmlns:xlink="http://www.w3.org/1999/xlink" stroke-dasharray="none" shape-rendering="auto" font-family="'Dialog'" width="1086" text-rendering="auto" fill-opacity="1" contentScriptType="text/ecmascript" color-interpolation="auto" color-rendering="auto" preserveAspectRatio="xMidYMid meet" font-size="12px" viewBox="0 0 1086 551" fill="black" stroke="black" image-rendering="auto" stroke-miterlimit="10" zoomAndPan="magnify" version="1.0" stroke-linecap="square" stroke-linejoin="miter" contentStyleType="text/css" font-style="normal" height="551" stroke-width="1" stroke-dashoffset="0" font-weight="normal" stroke-opacity="1">
    <!--Generated by the Batik Graphics2D SVG Generator-->
    <defs id="genericDefs"/>
    <g>
        <defs id="defs1">
            <linearGradient x1="16" x2="16" y1="130" gradientUnits="userSpaceOnUse" y2="191" xlink:type="simple" xlink:actuate="onLoad" id="linearGradient1" xlink:show="other" spreadMethod="pad">
                <stop stop-opacity="1" stop-color="rgb(195,215,221)" offset="0%"/>
                <stop stop-opacity="1" stop-color="rgb(225,225,135)" offset="100%"/>
            </linearGradient>
            <linearGradient x1="296" x2="296" y1="90" gradientUnits="userSpaceOnUse" y2="252" xlink:type="simple" xlink:actuate="onLoad" id="linearGradient2" xlink:show="other" spreadMethod="pad">
                <stop stop-opacity="1" stop-color="white" offset="0%"/>
                <stop stop-opacity="1" stop-color="rgb(195,215,221)" offset="100%"/>
            </linearGradient>
            <linearGradient x1="694" x2="694" y1="70" gradientUnits="userSpaceOnUse" y2="200" xlink:type="simple" xlink:actuate="onLoad" id="linearGradient3" xlink:show="other" spreadMethod="pad">
                <stop stop-opacity="1" stop-color="white" offset="0%"/>
                <stop stop-opacity="1" stop-color="rgb(195,215,221)" offset="100%"/>
            </linearGradient>
            <linearGradient x1="976" x2="976" y1="10" gradientUnits="userSpaceOnUse" y2="110" xlink:type="simple" xlink:actuate="onLoad" id="linearGradient4" xlink:show="other" spreadMethod="pad">
                <stop stop-opacity="1" stop-color="white" offset="0%"/>
                <stop stop-opacity="1" stop-color="rgb(195,209,213)" offset="100%"/>
            </linearGradient>
            <linearGradient x1="10" x2="10" y1="420" gradientUnits="userSpaceOnUse" y2="501" xlink:type="simple" xlink:actuate="onLoad" id="linearGradient5" xlink:show="other" spreadMethod="pad">
                <stop stop-opacity="1" stop-color="white" offset="0%"/>
                <stop stop-opacity="1" stop-color="rgb(225,225,135)" offset="100%"/>
            </linearGradient>
            <linearGradient x1="330" x2="330" y1="376" gradientUnits="userSpaceOnUse" y2="510" xlink:type="simple" xlink:actuate="onLoad" id="linearGradient6" xlink:show="other" spreadMethod="pad">
                <stop stop-opacity="1" stop-color="white" offset="0%"/>
                <stop stop-opacity="1" stop-color="rgb(225,225,135)" offset="100%"/>
            </linearGradient>
            <linearGradient x1="676" x2="676" y1="420" gradientUnits="userSpaceOnUse" y2="541" xlink:type="simple" xlink:actuate="onLoad" id="linearGradient7" xlink:show="other" spreadMethod="pad">
                <stop stop-opacity="1" stop-color="rgb(195,215,221)" offset="0%"/>
                <stop stop-opacity="1" stop-color="rgb(225,225,135)" offset="100%"/>
            </linearGradient>
            <clipPath clipPathUnits="userSpaceOnUse" id="clipPath1">
                <path d="M16 130 L16 190 L170 190 L170 130 Z"/>
            </clipPath>
            <clipPath clipPathUnits="userSpaceOnUse" id="clipPath2">
                <path d="M16 132 L172 132 L172 150 L16 150 L16 132 Z"/>
            </clipPath>
            <clipPath clipPathUnits="userSpaceOnUse" id="clipPath3">
                <path d="M72 132 L135 132 L135 149 L72 149 L72 132 Z"/>
            </clipPath>
            <clipPath clipPathUnits="userSpaceOnUse" id="clipPath4">
                <path d="M21 151 L168 151 L168 169 L21 169 L21 151 Z"/>
            </clipPath>
            <clipPath clipPathUnits="userSpaceOnUse" id="clipPath5">
                <path d="M40 151 L167 151 L167 168 L40 168 L40 151 Z"/>
            </clipPath>
            <clipPath clipPathUnits="userSpaceOnUse" id="clipPath6">
                <path d="M16 149 L172 149 L172 192 L16 192 L16 149 Z"/>
            </clipPath>
            <clipPath clipPathUnits="userSpaceOnUse" id="clipPath7">
                <path d="M15 129 L172 129 L172 192 L15 192 L15 129 Z"/>
            </clipPath>
            <clipPath clipPathUnits="userSpaceOnUse" id="clipPath8">
                <path d="M296 90 L296 251 L497 251 L497 90 Z"/>
            </clipPath>
            <clipPath clipPathUnits="userSpaceOnUse" id="clipPath9">
                <path d="M296 92 L499 92 L499 110 L296 110 L296 92 Z"/>
            </clipPath>
            <clipPath clipPathUnits="userSpaceOnUse" id="clipPath10">
                <path d="M393 92 L421 92 L421 109 L393 109 L393 92 Z"/>
            </clipPath>
            <clipPath clipPathUnits="userSpaceOnUse" id="clipPath11">
                <path d="M301 111 L495 111 L495 129 L301 129 L301 111 Z"/>
            </clipPath>
            <clipPath clipPathUnits="userSpaceOnUse" id="clipPath12">
                <path d="M320 111 L420 111 L420 128 L320 128 L320 111 Z"/>
            </clipPath>
            <clipPath clipPathUnits="userSpaceOnUse" id="clipPath13">
                <path d="M301 127 L495 127 L495 145 L301 145 L301 127 Z"/>
            </clipPath>
            <clipPath clipPathUnits="userSpaceOnUse" id="clipPath14">
                <path d="M320 127 L419 127 L419 144 L320 144 L320 127 Z"/>
            </clipPath>
            <clipPath clipPathUnits="userSpaceOnUse" id="clipPath15">
                <path d="M301 143 L495 143 L495 161 L301 161 L301 143 Z"/>
            </clipPath>
            <clipPath clipPathUnits="userSpaceOnUse" id="clipPath16">
                <path d="M320 143 L481 143 L481 160 L320 160 L320 143 Z"/>
            </clipPath>
            <clipPath clipPathUnits="userSpaceOnUse" id="clipPath17">
                <path d="M301 159 L495 159 L495 177 L301 177 L301 159 Z"/>
            </clipPath>
            <clipPath clipPathUnits="userSpaceOnUse" id="clipPath18">
                <path d="M320 159 L477 159 L477 176 L320 176 L320 159 Z"/>
            </clipPath>
            <clipPath clipPathUnits="userSpaceOnUse" id="clipPath19">
                <path d="M301 175 L495 175 L495 193 L301 193 L301 175 Z"/>
            </clipPath>
            <clipPath clipPathUnits="userSpaceOnUse" id="clipPath20">
                <path d="M320 175 L495 175 L495 192 L320 192 L320 175 Z"/>
            </clipPath>
            <clipPath clipPathUnits="userSpaceOnUse" id="clipPath21">
                <path d="M301 191 L495 191 L495 209 L301 209 L301 191 Z"/>
            </clipPath>
            <clipPath clipPathUnits="userSpaceOnUse" id="clipPath22">
                <path d="M320 191 L471 191 L471 208 L320 208 L320 191 Z"/>
            </clipPath>
            <clipPath clipPathUnits="userSpaceOnUse" id="clipPath23">
                <path d="M296 109 L499 109 L499 253 L296 253 L296 109 Z"/>
            </clipPath>
            <clipPath clipPathUnits="userSpaceOnUse" id="clipPath24">
                <path d="M295 89 L499 89 L499 253 L295 253 L295 89 Z"/>
            </clipPath>
            <clipPath clipPathUnits="userSpaceOnUse" id="clipPath25">
                <path d="M694 70 L694 199 L896 199 L896 70 Z"/>
            </clipPath>
            <clipPath clipPathUnits="userSpaceOnUse" id="clipPath26">
                <path d="M694 72 L898 72 L898 90 L694 90 L694 72 Z"/>
            </clipPath>
            <clipPath clipPathUnits="userSpaceOnUse" id="clipPath27">
                <path d="M783 72 L828 72 L828 89 L783 89 L783 72 Z"/>
            </clipPath>
            <clipPath clipPathUnits="userSpaceOnUse" id="clipPath28">
                <path d="M699 91 L894 91 L894 109 L699 109 L699 91 Z"/>
            </clipPath>
            <clipPath clipPathUnits="userSpaceOnUse" id="clipPath29">
                <path d="M718 91 L818 91 L818 108 L718 108 L718 91 Z"/>
            </clipPath>
            <clipPath clipPathUnits="userSpaceOnUse" id="clipPath30">
                <path d="M699 107 L894 107 L894 125 L699 125 L699 107 Z"/>
            </clipPath>
            <clipPath clipPathUnits="userSpaceOnUse" id="clipPath31">
                <path d="M718 107 L867 107 L867 124 L718 124 L718 107 Z"/>
            </clipPath>
            <clipPath clipPathUnits="userSpaceOnUse" id="clipPath32">
                <path d="M699 123 L894 123 L894 141 L699 141 L699 123 Z"/>
            </clipPath>
            <clipPath clipPathUnits="userSpaceOnUse" id="clipPath33">
                <path d="M718 123 L882 123 L882 140 L718 140 L718 123 Z"/>
            </clipPath>
            <clipPath clipPathUnits="userSpaceOnUse" id="clipPath34">
                <path d="M699 139 L894 139 L894 157 L699 157 L699 139 Z"/>
            </clipPath>
            <clipPath clipPathUnits="userSpaceOnUse" id="clipPath35">
                <path d="M718 139 L890 139 L890 156 L718 156 L718 139 Z"/>
            </clipPath>
            <clipPath clipPathUnits="userSpaceOnUse" id="clipPath36">
                <path d="M694 89 L898 89 L898 201 L694 201 L694 89 Z"/>
            </clipPath>
            <clipPath clipPathUnits="userSpaceOnUse" id="clipPath37">
                <path d="M693 69 L898 69 L898 201 L693 201 L693 69 Z"/>
            </clipPath>
            <clipPath clipPathUnits="userSpaceOnUse" id="clipPath38">
                <path d="M976 10 L976 109 L1075 109 L1075 10 Z"/>
            </clipPath>
            <clipPath clipPathUnits="userSpaceOnUse" id="clipPath39">
                <path d="M976 12 L1077 12 L1077 30 L976 30 L976 12 Z"/>
            </clipPath>
            <clipPath clipPathUnits="userSpaceOnUse" id="clipPath40">
                <path d="M1001 12 L1071 12 L1071 29 L1001 29 L1001 12 Z"/>
            </clipPath>
            <clipPath clipPathUnits="userSpaceOnUse" id="clipPath41">
                <path d="M976 29 L1077 29 L1077 111 L976 111 L976 29 Z"/>
            </clipPath>
            <clipPath clipPathUnits="userSpaceOnUse" id="clipPath42">
                <path d="M975 9 L1077 9 L1077 111 L975 111 L975 9 Z"/>
            </clipPath>
            <clipPath clipPathUnits="userSpaceOnUse" id="clipPath43">
                <path d="M10 420 L10 500 L175 500 L175 420 Z"/>
            </clipPath>
            <clipPath clipPathUnits="userSpaceOnUse" id="clipPath44">
                <path d="M10 422 L177 422 L177 440 L10 440 L10 422 Z"/>
            </clipPath>
            <clipPath clipPathUnits="userSpaceOnUse" id="clipPath45">
                <path d="M85 422 L121 422 L121 439 L85 439 L85 422 Z"/>
            </clipPath>
            <clipPath clipPathUnits="userSpaceOnUse" id="clipPath46">
                <path d="M15 441 L173 441 L173 459 L15 459 L15 441 Z"/>
            </clipPath>
            <clipPath clipPathUnits="userSpaceOnUse" id="clipPath47">
                <path d="M34 441 L173 441 L173 458 L34 458 L34 441 Z"/>
            </clipPath>
            <clipPath clipPathUnits="userSpaceOnUse" id="clipPath48">
                <path d="M15 457 L173 457 L173 475 L15 475 L15 457 Z"/>
            </clipPath>
            <clipPath clipPathUnits="userSpaceOnUse" id="clipPath49">
                <path d="M34 457 L165 457 L165 474 L34 474 L34 457 Z"/>
            </clipPath>
            <clipPath clipPathUnits="userSpaceOnUse" id="clipPath50">
                <path d="M10 439 L177 439 L177 502 L10 502 L10 439 Z"/>
            </clipPath>
            <clipPath clipPathUnits="userSpaceOnUse" id="clipPath51">
                <path d="M9 419 L177 419 L177 502 L9 502 L9 419 Z"/>
            </clipPath>
            <clipPath clipPathUnits="userSpaceOnUse" id="clipPath52">
                <path d="M330 376 L330 509 L531 509 L531 376 Z"/>
            </clipPath>
            <clipPath clipPathUnits="userSpaceOnUse" id="clipPath53">
                <path d="M330 378 L533 378 L533 396 L330 396 L330 378 Z"/>
            </clipPath>
            <clipPath clipPathUnits="userSpaceOnUse" id="clipPath54">
                <path d="M415 378 L468 378 L468 395 L415 395 L415 378 Z"/>
            </clipPath>
            <clipPath clipPathUnits="userSpaceOnUse" id="clipPath55">
                <path d="M335 397 L529 397 L529 415 L335 415 L335 397 Z"/>
            </clipPath>
            <clipPath clipPathUnits="userSpaceOnUse" id="clipPath56">
                <path d="M354 397 L493 397 L493 414 L354 414 L354 397 Z"/>
            </clipPath>
            <clipPath clipPathUnits="userSpaceOnUse" id="clipPath57">
                <path d="M335 413 L529 413 L529 431 L335 431 L335 413 Z"/>
            </clipPath>
            <clipPath clipPathUnits="userSpaceOnUse" id="clipPath58">
                <path d="M354 413 L485 413 L485 430 L354 430 L354 413 Z"/>
            </clipPath>
            <clipPath clipPathUnits="userSpaceOnUse" id="clipPath59">
                <path d="M335 429 L529 429 L529 447 L335 447 L335 429 Z"/>
            </clipPath>
            <clipPath clipPathUnits="userSpaceOnUse" id="clipPath60">
                <path d="M354 429 L511 429 L511 446 L354 446 L354 429 Z"/>
            </clipPath>
            <clipPath clipPathUnits="userSpaceOnUse" id="clipPath61">
                <path d="M335 445 L529 445 L529 463 L335 463 L335 445 Z"/>
            </clipPath>
            <clipPath clipPathUnits="userSpaceOnUse" id="clipPath62">
                <path d="M354 445 L529 445 L529 462 L354 462 L354 445 Z"/>
            </clipPath>
            <clipPath clipPathUnits="userSpaceOnUse" id="clipPath63">
                <path d="M335 461 L529 461 L529 479 L335 479 L335 461 Z"/>
            </clipPath>
            <clipPath clipPathUnits="userSpaceOnUse" id="clipPath64">
                <path d="M354 461 L487 461 L487 478 L354 478 L354 461 Z"/>
            </clipPath>
            <clipPath clipPathUnits="userSpaceOnUse" id="clipPath65">
                <path d="M330 395 L533 395 L533 511 L330 511 L330 395 Z"/>
            </clipPath>
            <clipPath clipPathUnits="userSpaceOnUse" id="clipPath66">
                <path d="M329 375 L533 375 L533 511 L329 511 L329 375 Z"/>
            </clipPath>
            <clipPath clipPathUnits="userSpaceOnUse" id="clipPath67">
                <path d="M676 420 L676 540 L926 540 L926 420 Z"/>
            </clipPath>
            <clipPath clipPathUnits="userSpaceOnUse" id="clipPath68">
                <path d="M676 422 L928 422 L928 440 L676 440 L676 422 Z"/>
            </clipPath>
            <clipPath clipPathUnits="userSpaceOnUse" id="clipPath69">
                <path d="M783 422 L841 422 L841 439 L783 439 L783 422 Z"/>
            </clipPath>
            <clipPath clipPathUnits="userSpaceOnUse" id="clipPath70">
                <path d="M681 441 L924 441 L924 459 L681 459 L681 441 Z"/>
            </clipPath>
            <clipPath clipPathUnits="userSpaceOnUse" id="clipPath71">
                <path d="M700 441 L840 441 L840 458 L700 458 L700 441 Z"/>
            </clipPath>
            <clipPath clipPathUnits="userSpaceOnUse" id="clipPath72">
                <path d="M681 457 L924 457 L924 475 L681 475 L681 457 Z"/>
            </clipPath>
            <clipPath clipPathUnits="userSpaceOnUse" id="clipPath73">
                <path d="M700 457 L866 457 L866 474 L700 474 L700 457 Z"/>
            </clipPath>
            <clipPath clipPathUnits="userSpaceOnUse" id="clipPath74">
                <path d="M681 473 L924 473 L924 491 L681 491 L681 473 Z"/>
            </clipPath>
            <clipPath clipPathUnits="userSpaceOnUse" id="clipPath75">
                <path d="M700 473 L882 473 L882 490 L700 490 L700 473 Z"/>
            </clipPath>
            <clipPath clipPathUnits="userSpaceOnUse" id="clipPath76">
                <path d="M681 489 L924 489 L924 507 L681 507 L681 489 Z"/>
            </clipPath>
            <clipPath clipPathUnits="userSpaceOnUse" id="clipPath77">
                <path d="M700 489 L858 489 L858 506 L700 506 L700 489 Z"/>
            </clipPath>
            <clipPath clipPathUnits="userSpaceOnUse" id="clipPath78">
                <path d="M681 505 L924 505 L924 523 L681 523 L681 505 Z"/>
            </clipPath>
            <clipPath clipPathUnits="userSpaceOnUse" id="clipPath79">
                <path d="M700 505 L924 505 L924 522 L700 522 L700 505 Z"/>
            </clipPath>
            <clipPath clipPathUnits="userSpaceOnUse" id="clipPath80">
                <path d="M676 439 L928 439 L928 542 L676 542 L676 439 Z"/>
            </clipPath>
            <clipPath clipPathUnits="userSpaceOnUse" id="clipPath81">
                <path d="M675 419 L928 419 L928 542 L675 542 L675 419 Z"/>
            </clipPath>
            <clipPath clipPathUnits="userSpaceOnUse" id="clipPath82">
                <path d="M-1 -1 L1087 -1 L1087 552 L-1 552 L-1 -1 Z"/>
            </clipPath>
            <clipPath clipPathUnits="userSpaceOnUse" id="clipPath83">
                <path d="M195 149 L253 149 L253 166 L195 166 L195 149 Z"/>
            </clipPath>
            <clipPath clipPathUnits="userSpaceOnUse" id="clipPath84">
                <path d="M183 143 L191 143 L191 160 L183 160 L183 143 Z"/>
            </clipPath>
            <clipPath clipPathUnits="userSpaceOnUse" id="clipPath85">
                <path d="M255 189 L288 189 L288 206 L255 206 L255 189 Z"/>
            </clipPath>
            <clipPath clipPathUnits="userSpaceOnUse" id="clipPath86">
                <path d="M180 180 L190 180 L190 197 L180 197 L180 180 Z"/>
            </clipPath>
            <clipPath clipPathUnits="userSpaceOnUse" id="clipPath87">
                <path d="M276 143 L286 143 L286 160 L276 160 L276 143 Z"/>
            </clipPath>
            <clipPath clipPathUnits="userSpaceOnUse" id="clipPath88">
                <path d="M170 165 L189 165 L189 176 L170 176 L170 165 Z"/>
            </clipPath>
            <clipPath clipPathUnits="userSpaceOnUse" id="clipPath89">
                <path d="M277 163 L298 163 L298 178 L277 178 L277 163 Z"/>
            </clipPath>
            <clipPath clipPathUnits="userSpaceOnUse" id="clipPath90">
                <path d="M548 149 L622 149 L622 166 L548 166 L548 149 Z"/>
            </clipPath>
            <clipPath clipPathUnits="userSpaceOnUse" id="clipPath91">
                <path d="M492 129 L500 129 L500 146 L492 146 L492 129 Z"/>
            </clipPath>
            <clipPath clipPathUnits="userSpaceOnUse" id="clipPath92">
                <path d="M597 189 L682 189 L682 206 L597 206 L597 189 Z"/>
            </clipPath>
            <clipPath clipPathUnits="userSpaceOnUse" id="clipPath93">
                <path d="M509 169 L519 169 L519 186 L509 186 L509 169 Z"/>
            </clipPath>
            <clipPath clipPathUnits="userSpaceOnUse" id="clipPath94">
                <path d="M673 149 L695 149 L695 166 L673 166 L673 149 Z"/>
            </clipPath>
            <clipPath clipPathUnits="userSpaceOnUse" id="clipPath95">
                <path d="M497 165 L516 165 L516 176 L497 176 L497 165 Z"/>
            </clipPath>
            <clipPath clipPathUnits="userSpaceOnUse" id="clipPath96">
                <path d="M675 163 L696 163 L696 178 L675 178 L675 163 Z"/>
            </clipPath>
            <clipPath clipPathUnits="userSpaceOnUse" id="clipPath97">
                <path d="M835 209 L884 209 L884 226 L835 226 L835 209 Z"/>
            </clipPath>
            <clipPath clipPathUnits="userSpaceOnUse" id="clipPath98">
                <path d="M900 149 L981 149 L981 166 L900 166 L900 149 Z"/>
            </clipPath>
            <clipPath clipPathUnits="userSpaceOnUse" id="clipPath99">
                <path d="M896 123 L917 123 L917 138 L896 138 L896 123 Z"/>
            </clipPath>
            <clipPath clipPathUnits="userSpaceOnUse" id="clipPath100">
                <path d="M130 202 L135 202 L135 219 L130 219 L130 202 Z"/>
            </clipPath>
            <clipPath clipPathUnits="userSpaceOnUse" id="clipPath101">
                <path d="M35 389 L76 389 L76 406 L35 406 L35 389 Z"/>
            </clipPath>
            <clipPath clipPathUnits="userSpaceOnUse" id="clipPath102">
                <path d="M75 189 L85 189 L85 206 L75 206 L75 189 Z"/>
            </clipPath>
            <clipPath clipPathUnits="userSpaceOnUse" id="clipPath103">
                <path d="M115 389 L138 389 L138 406 L115 406 L115 389 Z"/>
            </clipPath>
            <clipPath clipPathUnits="userSpaceOnUse" id="clipPath104">
                <path d="M89 401 L104 401 L104 422 L89 422 L89 401 Z"/>
            </clipPath>
            <clipPath clipPathUnits="userSpaceOnUse" id="clipPath105">
                <path d="M209 449 L273 449 L273 466 L209 466 L209 449 Z"/>
            </clipPath>
            <clipPath clipPathUnits="userSpaceOnUse" id="clipPath106">
                <path d="M197 442 L202 442 L202 459 L197 459 L197 442 Z"/>
            </clipPath>
            <clipPath clipPathUnits="userSpaceOnUse" id="clipPath107">
                <path d="M252 469 L310 469 L310 486 L252 486 L252 469 Z"/>
            </clipPath>
            <clipPath clipPathUnits="userSpaceOnUse" id="clipPath108">
                <path d="M194 482 L204 482 L204 499 L194 499 L194 482 Z"/>
            </clipPath>
            <clipPath clipPathUnits="userSpaceOnUse" id="clipPath109">
                <path d="M295 442 L317 442 L317 459 L295 459 L295 442 Z"/>
            </clipPath>
            <clipPath clipPathUnits="userSpaceOnUse" id="clipPath110">
                <path d="M175 465 L194 465 L194 476 L175 476 L175 465 Z"/>
            </clipPath>
            <clipPath clipPathUnits="userSpaceOnUse" id="clipPath111">
                <path d="M311 463 L332 463 L332 478 L311 478 L311 463 Z"/>
            </clipPath>
            <clipPath clipPathUnits="userSpaceOnUse" id="clipPath112">
                <path d="M774 289 L851 289 L851 306 L774 306 L774 289 Z"/>
            </clipPath>
            <clipPath clipPathUnits="userSpaceOnUse" id="clipPath113">
                <path d="M814 226 L819 226 L819 243 L814 243 L814 226 Z"/>
            </clipPath>
            <clipPath clipPathUnits="userSpaceOnUse" id="clipPath114">
                <path d="M790 369 L869 369 L869 386 L790 386 L790 369 Z"/>
            </clipPath>
            <clipPath clipPathUnits="userSpaceOnUse" id="clipPath115">
                <path d="M795 209 L805 209 L805 226 L795 226 L795 209 Z"/>
            </clipPath>
            <clipPath clipPathUnits="userSpaceOnUse" id="clipPath116">
                <path d="M801 389 L811 389 L811 406 L801 406 L801 389 Z"/>
            </clipPath>
            <clipPath clipPathUnits="userSpaceOnUse" id="clipPath117">
                <path d="M791 199 L802 199 L802 218 L791 218 L791 199 Z"/>
            </clipPath>
            <clipPath clipPathUnits="userSpaceOnUse" id="clipPath118">
                <path d="M789 401 L804 401 L804 422 L789 422 L789 401 Z"/>
            </clipPath>
            <clipPath clipPathUnits="userSpaceOnUse" id="clipPath119">
                <path d="M573 450 L623 450 L623 467 L573 467 L573 450 Z"/>
            </clipPath>
            <clipPath clipPathUnits="userSpaceOnUse" id="clipPath120">
                <path d="M554 444 L559 444 L559 461 L554 461 L554 444 Z"/>
            </clipPath>
            <clipPath clipPathUnits="userSpaceOnUse" id="clipPath121">
                <path d="M578 488 L668 488 L668 505 L578 505 L578 488 Z"/>
            </clipPath>
            <clipPath clipPathUnits="userSpaceOnUse" id="clipPath122">
                <path d="M551 481 L561 481 L561 498 L551 498 L551 481 Z"/>
            </clipPath>
            <clipPath clipPathUnits="userSpaceOnUse" id="clipPath123">
                <path d="M646 444 L656 444 L656 461 L646 461 L646 444 Z"/>
            </clipPath>
            <clipPath clipPathUnits="userSpaceOnUse" id="clipPath124">
                <path d="M531 465 L550 465 L550 476 L531 476 L531 465 Z"/>
            </clipPath>
            <clipPath clipPathUnits="userSpaceOnUse" id="clipPath125">
                <path d="M657 463 L678 463 L678 478 L657 478 L657 463 Z"/>
            </clipPath>
            <clipPath clipPathUnits="userSpaceOnUse" id="clipPath126">
                <path d="M661 301 L736 301 L736 318 L661 318 L661 301 Z"/>
            </clipPath>
            <clipPath clipPathUnits="userSpaceOnUse" id="clipPath127">
                <path d="M696 225 L701 225 L701 242 L696 242 L696 225 Z"/>
            </clipPath>
            <clipPath clipPathUnits="userSpaceOnUse" id="clipPath128">
                <path d="M631 370 L707 370 L707 387 L631 387 L631 370 Z"/>
            </clipPath>
            <clipPath clipPathUnits="userSpaceOnUse" id="clipPath129">
                <path d="M699 174 L709 174 L709 191 L699 191 L699 174 Z"/>
            </clipPath>
            <clipPath clipPathUnits="userSpaceOnUse" id="clipPath130">
                <path d="M685 379 L708 379 L708 396 L685 396 L685 379 Z"/>
            </clipPath>
            <clipPath clipPathUnits="userSpaceOnUse" id="clipPath131">
                <path d="M711 199 L722 199 L722 218 L711 218 L711 199 Z"/>
            </clipPath>
            <clipPath clipPathUnits="userSpaceOnUse" id="clipPath132">
                <path d="M709 401 L724 401 L724 422 L709 422 L709 401 Z"/>
            </clipPath>
        </defs>
        <g fill="url(#linearGradient1)" stroke-miterlimit="0" stroke-width="0" font-family="'Noto Sans'" stroke="url(#linearGradient1)" stroke-linejoin="round">
            <rect x="16" width="155" height="61" y="130" clip-path="url(#clipPath1)" stroke="none"/>
            <image stroke="black" width="16" xlink:show="embed" xlink:type="simple" fill="black" clip-path="url(#clipPath2)" preserveAspectRatio="none" height="16" font-family="'Dialog'" x="54" y="133" xlink:href="data:image/png;base64,iVBORw0KGgoAAAANSUhEUgAAABAAAAAQCAYAAAAf8/9hAAAArklEQVR4XmNggIKC&#10;BUf+B7RsA+LtYNofTG//798KpKEYJAbDIPUwvWDg37zt/8OXX4jGfs1bUQ3wbdjy&#10;/8X770Rjv8YtmAa8+fSTaIzVgA9ffxGNsRrw9ccfojGmAfWb///6/Zdo7ANUj2KA&#10;T93G/3///iMae9dtwjTAu3YDEG/871WLyoZhCB8kvuE/SD2GAegBhQ/TxgBSMYYB&#10;6Lbgw9Q3AJS70J2ID2PkRnIBAM3ojW1qXQwfAAAAAElFTkSuQmCC" xlink:actuate="onLoad"/>
            <text x="73" y="146" clip-path="url(#clipPath3)" fill="black" font-family="'Dialog'" stroke="none" xml:space="preserve">Application</text>
            <image stroke="black" width="16" xlink:show="embed" xlink:type="simple" fill="black" clip-path="url(#clipPath4)" preserveAspectRatio="none" height="16" font-family="'Dialog'" x="22" y="152" xlink:href="data:image/png;base64,iVBORw0KGgoAAAANSUhEUgAAABAAAAAQCAYAAAAf8/9hAAAA3UlEQVR4Xu2OvQ4B&#10;URCF93lsRbnK1W5JSaVRUFBQ0VBRUJB4AskmJFtISMjGmwgJBY3CP8fMdQsjJJQS&#10;k3w5586cnFzD+I+aVHuCbxEFyaaPyxUfk2z5siDeGON4AeKN0Z261mdPcC5BKgpi&#10;1SG2dIhVB5ju8JYo586Uqw1lgVPuY3MCWDnIXnGW6lR0jlQU2EUPqyNglzxVsCbP&#10;b4a94nC/8y5CeVFgFXpYUMDKd2EVXhPWtyXnSEVBMOdivgdmxJx+wF6gd+pOhLKu&#10;LDAzHQQIVjP9wKu33omC354be7Zv3Rr6AnYAAAAASUVORK5CYII=" xlink:actuate="onLoad"/>
            <text x="41" y="165" clip-path="url(#clipPath5)" fill="black" font-family="'Dialog'" stroke="none" xml:space="preserve"> + apiVersion: String [1]</text>
        </g>
        <g stroke-linecap="butt" font-family="'Noto Sans'" stroke-width="1.1">
            <line y2="150" fill="none" x1="16" clip-path="url(#clipPath6)" x2="171" y1="150"/>
            <rect x="16" y="130" clip-path="url(#clipPath7)" fill="none" width="154" rx="0" ry="0" height="60"/>
            <rect x="296" y="90" clip-path="url(#clipPath8)" fill="url(#linearGradient2)" width="202" height="162" stroke="none"/>
            <image x="375" y="93" clip-path="url(#clipPath9)" width="16" xlink:href="data:image/png;base64,iVBORw0KGgoAAAANSUhEUgAAABAAAAAQCAYAAAAf8/9hAAAArklEQVR4XmNggIKC&#10;BUf+B7RsA+LtYNofTG//798KpKEYJAbDIPUwvWDg37zt/8OXX4jGfs1bUQ3wbdjy&#10;/8X770Rjv8YtmAa8+fSTaIzVgA9ffxGNsRrw9ccfojGmAfWb///6/Zdo7ANUj2KA&#10;T93G/3///iMae9dtwjTAu3YDEG/871WLyoZhCB8kvuE/SD2GAegBhQ/TxgBSMYYB&#10;6Lbgw9Q3AJS70J2ID2PkRnIBAM3ojW1qXQwfAAAAAElFTkSuQmCC" font-family="'Dialog'" xlink:type="simple" xlink:actuate="onLoad" height="16" preserveAspectRatio="none" xlink:show="embed"/>
            <text x="394" xml:space="preserve" y="106" clip-path="url(#clipPath10)" font-family="'Dialog'" stroke="none">Spec</text>
            <image x="302" y="112" clip-path="url(#clipPath11)" width="16" xlink:href="data:image/png;base64,iVBORw0KGgoAAAANSUhEUgAAABAAAAAQCAYAAAAf8/9hAAAA3UlEQVR4Xu2OvQ4B&#10;URCF93lsRbnK1W5JSaVRUFBQ0VBRUJB4AskmJFtISMjGmwgJBY3CP8fMdQsjJJQS&#10;k3w5586cnFzD+I+aVHuCbxEFyaaPyxUfk2z5siDeGON4AeKN0Z261mdPcC5BKgpi&#10;1SG2dIhVB5ju8JYo586Uqw1lgVPuY3MCWDnIXnGW6lR0jlQU2EUPqyNglzxVsCbP&#10;b4a94nC/8y5CeVFgFXpYUMDKd2EVXhPWtyXnSEVBMOdivgdmxJx+wF6gd+pOhLKu&#10;LDAzHQQIVjP9wKu33omC354be7Zv3Rr6AnYAAAAASUVORK5CYII=" font-family="'Dialog'" xlink:type="simple" xlink:actuate="onLoad" height="16" preserveAspectRatio="none" xlink:show="embed"/>
            <text x="321" xml:space="preserve" y="125" clip-path="url(#clipPath12)" font-family="'Dialog'" stroke="none"> + name: String [1]</text>
            <image x="302" y="128" clip-path="url(#clipPath13)" width="16" xlink:href="data:image/png;base64,iVBORw0KGgoAAAANSUhEUgAAABAAAAAQCAYAAAAf8/9hAAAA3UlEQVR4Xu2OvQ4B&#10;URCF93lsRbnK1W5JSaVRUFBQ0VBRUJB4AskmJFtISMjGmwgJBY3CP8fMdQsjJJQS&#10;k3w5586cnFzD+I+aVHuCbxEFyaaPyxUfk2z5siDeGON4AeKN0Z261mdPcC5BKgpi&#10;1SG2dIhVB5ju8JYo586Uqw1lgVPuY3MCWDnIXnGW6lR0jlQU2EUPqyNglzxVsCbP&#10;b4a94nC/8y5CeVFgFXpYUMDKd2EVXhPWtyXnSEVBMOdivgdmxJx+wF6gd+pOhLKu&#10;LDAzHQQIVjP9wKu33omC354be7Zv3Rr6AnYAAAAASUVORK5CYII=" font-family="'Dialog'" xlink:type="simple" xlink:actuate="onLoad" height="16" preserveAspectRatio="none" xlink:show="embed"/>
            <text x="321" xml:space="preserve" y="141" clip-path="url(#clipPath14)" font-family="'Dialog'" stroke="none"> + qos: QoSDef [1]</text>
            <image x="302" y="144" clip-path="url(#clipPath15)" width="16" xlink:href="data:image/png;base64,iVBORw0KGgoAAAANSUhEUgAAABAAAAAQCAYAAAAf8/9hAAAA3UlEQVR4Xu2OvQ4B&#10;URCF93lsRbnK1W5JSaVRUFBQ0VBRUJB4AskmJFtISMjGmwgJBY3CP8fMdQsjJJQS&#10;k3w5586cnFzD+I+aVHuCbxEFyaaPyxUfk2z5siDeGON4AeKN0Z261mdPcC5BKgpi&#10;1SG2dIhVB5ju8JYo586Uqw1lgVPuY3MCWDnIXnGW6lR0jlQU2EUPqyNglzxVsCbP&#10;b4a94nC/8y5CeVFgFXpYUMDKd2EVXhPWtyXnSEVBMOdivgdmxJx+wF6gd+pOhLKu&#10;LDAzHQQIVjP9wKu33omC354be7Zv3Rr6AnYAAAAASUVORK5CYII=" font-family="'Dialog'" xlink:type="simple" xlink:actuate="onLoad" height="16" preserveAspectRatio="none" xlink:show="embed"/>
            <text x="321" xml:space="preserve" y="157" clip-path="url(#clipPath16)" font-family="'Dialog'" stroke="none"> + compliance: Compiance [*]</text>
            <image x="302" y="160" clip-path="url(#clipPath17)" width="16" xlink:href="data:image/png;base64,iVBORw0KGgoAAAANSUhEUgAAABAAAAAQCAYAAAAf8/9hAAAA3UlEQVR4Xu2OvQ4B&#10;URCF93lsRbnK1W5JSaVRUFBQ0VBRUJB4AskmJFtISMjGmwgJBY3CP8fMdQsjJJQS&#10;k3w5586cnFzD+I+aVHuCbxEFyaaPyxUfk2z5siDeGON4AeKN0Z261mdPcC5BKgpi&#10;1SG2dIhVB5ju8JYo586Uqw1lgVPuY3MCWDnIXnGW6lR0jlQU2EUPqyNglzxVsCbP&#10;b4a94nC/8y5CeVFgFXpYUMDKd2EVXhPWtyXnSEVBMOdivgdmxJx+wF6gd+pOhLKu&#10;LDAzHQQIVjP9wKu33omC354be7Zv3Rr6AnYAAAAASUVORK5CYII=" font-family="'Dialog'" xlink:type="simple" xlink:actuate="onLoad" height="16" preserveAspectRatio="none" xlink:show="embed"/>
            <text x="321" xml:space="preserve" y="173" clip-path="url(#clipPath18)" font-family="'Dialog'" stroke="none"> + failureTolerance: String [1]</text>
            <image x="302" y="176" clip-path="url(#clipPath19)" width="16" xlink:href="data:image/png;base64,iVBORw0KGgoAAAANSUhEUgAAABAAAAAQCAYAAAAf8/9hAAAA3UlEQVR4Xu2OvQ4B&#10;URCF93lsRbnK1W5JSaVRUFBQ0VBRUJB4AskmJFtISMjGmwgJBY3CP8fMdQsjJJQS&#10;k3w5586cnFzD+I+aVHuCbxEFyaaPyxUfk2z5siDeGON4AeKN0Z261mdPcC5BKgpi&#10;1SG2dIhVB5ju8JYo586Uqw1lgVPuY3MCWDnIXnGW6lR0jlQU2EUPqyNglzxVsCbP&#10;b4a94nC/8y5CeVFgFXpYUMDKd2EVXhPWtyXnSEVBMOdivgdmxJx+wF6gd+pOhLKu&#10;LDAzHQQIVjP9wKu33omC354be7Zv3Rr6AnYAAAAASUVORK5CYII=" font-family="'Dialog'" xlink:type="simple" xlink:actuate="onLoad" height="16" preserveAspectRatio="none" xlink:show="embed"/>
            <text x="321" xml:space="preserve" y="189" clip-path="url(#clipPath20)" font-family="'Dialog'" stroke="none"> + energyExpenditure : String [1]</text>
            <image x="302" y="192" clip-path="url(#clipPath21)" width="16" xlink:href="data:image/png;base64,iVBORw0KGgoAAAANSUhEUgAAABAAAAAQCAYAAAAf8/9hAAAA3UlEQVR4Xu2OvQ4B&#10;URCF93lsRbnK1W5JSaVRUFBQ0VBRUJB4AskmJFtISMjGmwgJBY3CP8fMdQsjJJQS&#10;k3w5586cnFzD+I+aVHuCbxEFyaaPyxUfk2z5siDeGON4AeKN0Z261mdPcC5BKgpi&#10;1SG2dIhVB5ju8JYo586Uqw1lgVPuY3MCWDnIXnGW6lR0jlQU2EUPqyNglzxVsCbP&#10;b4a94nC/8y5CeVFgFXpYUMDKd2EVXhPWtyXnSEVBMOdivgdmxJx+wF6gd+pOhLKu&#10;LDAzHQQIVjP9wKu33omC354be7Zv3Rr6AnYAAAAASUVORK5CYII=" font-family="'Dialog'" xlink:type="simple" xlink:actuate="onLoad" height="16" preserveAspectRatio="none" xlink:show="embed"/>
            <text x="321" xml:space="preserve" y="205" clip-path="url(#clipPath22)" font-family="'Dialog'" stroke="none"> + securityLevel: Security [1]</text>
            <line y2="110" fill="none" x1="296" clip-path="url(#clipPath23)" x2="498" y1="110"/>
            <rect x="296" y="90" clip-path="url(#clipPath24)" fill="none" width="201" rx="0" ry="0" height="161"/>
            <rect x="694" y="70" clip-path="url(#clipPath25)" fill="url(#linearGradient3)" width="203" height="130" stroke="none"/>
            <image x="765" y="73" clip-path="url(#clipPath26)" width="16" xlink:href="data:image/png;base64,iVBORw0KGgoAAAANSUhEUgAAABAAAAAQCAYAAAAf8/9hAAAArklEQVR4XmNggIKC&#10;BUf+B7RsA+LtYNofTG//798KpKEYJAbDIPUwvWDg37zt/8OXX4jGfs1bUQ3wbdjy&#10;/8X770Rjv8YtmAa8+fSTaIzVgA9ffxGNsRrw9ccfojGmAfWb///6/Zdo7ANUj2KA&#10;T93G/3///iMae9dtwjTAu3YDEG/871WLyoZhCB8kvuE/SD2GAegBhQ/TxgBSMYYB&#10;6Lbgw9Q3AJS70J2ID2PkRnIBAM3ojW1qXQwfAAAAAElFTkSuQmCC" font-family="'Dialog'" xlink:type="simple" xlink:actuate="onLoad" height="16" preserveAspectRatio="none" xlink:show="embed"/>
            <text x="784" xml:space="preserve" y="86" clip-path="url(#clipPath27)" font-family="'Dialog'" stroke="none">MSSpec</text>
            <image x="700" y="92" clip-path="url(#clipPath28)" width="16" xlink:href="data:image/png;base64,iVBORw0KGgoAAAANSUhEUgAAABAAAAAQCAYAAAAf8/9hAAAA3UlEQVR4Xu2OvQ4B&#10;URCF93lsRbnK1W5JSaVRUFBQ0VBRUJB4AskmJFtISMjGmwgJBY3CP8fMdQsjJJQS&#10;k3w5586cnFzD+I+aVHuCbxEFyaaPyxUfk2z5siDeGON4AeKN0Z261mdPcC5BKgpi&#10;1SG2dIhVB5ju8JYo586Uqw1lgVPuY3MCWDnIXnGW6lR0jlQU2EUPqyNglzxVsCbP&#10;b4a94nC/8y5CeVFgFXpYUMDKd2EVXhPWtyXnSEVBMOdivgdmxJx+wF6gd+pOhLKu&#10;LDAzHQQIVjP9wKu33omC354be7Zv3Rr6AnYAAAAASUVORK5CYII=" font-family="'Dialog'" xlink:type="simple" xlink:actuate="onLoad" height="16" preserveAspectRatio="none" xlink:show="embed"/>
            <text x="719" xml:space="preserve" y="105" clip-path="url(#clipPath29)" font-family="'Dialog'" stroke="none"> + name: String [1]</text>
            <image x="700" y="108" clip-path="url(#clipPath30)" width="16" xlink:href="data:image/png;base64,iVBORw0KGgoAAAANSUhEUgAAABAAAAAQCAYAAAAf8/9hAAAA3UlEQVR4Xu2OvQ4B&#10;URCF93lsRbnK1W5JSaVRUFBQ0VBRUJB4AskmJFtISMjGmwgJBY3CP8fMdQsjJJQS&#10;k3w5586cnFzD+I+aVHuCbxEFyaaPyxUfk2z5siDeGON4AeKN0Z261mdPcC5BKgpi&#10;1SG2dIhVB5ju8JYo586Uqw1lgVPuY3MCWDnIXnGW6lR0jlQU2EUPqyNglzxVsCbP&#10;b4a94nC/8y5CeVFgFXpYUMDKd2EVXhPWtyXnSEVBMOdivgdmxJx+wF6gd+pOhLKu&#10;LDAzHQQIVjP9wKu33omC354be7Zv3Rr6AnYAAAAASUVORK5CYII=" font-family="'Dialog'" xlink:type="simple" xlink:actuate="onLoad" height="16" preserveAspectRatio="none" xlink:show="embed"/>
            <text x="719" xml:space="preserve" y="121" clip-path="url(#clipPath31)" font-family="'Dialog'" stroke="none"> + podSpecName: String [1]</text>
            <image x="700" y="124" clip-path="url(#clipPath32)" width="16" xlink:href="data:image/png;base64,iVBORw0KGgoAAAANSUhEUgAAABAAAAAQCAYAAAAf8/9hAAAA3UlEQVR4Xu2OvQ4B&#10;URCF93lsRbnK1W5JSaVRUFBQ0VBRUJB4AskmJFtISMjGmwgJBY3CP8fMdQsjJJQS&#10;k3w5586cnFzD+I+aVHuCbxEFyaaPyxUfk2z5siDeGON4AeKN0Z261mdPcC5BKgpi&#10;1SG2dIhVB5ju8JYo586Uqw1lgVPuY3MCWDnIXnGW6lR0jlQU2EUPqyNglzxVsCbP&#10;b4a94nC/8y5CeVFgFXpYUMDKd2EVXhPWtyXnSEVBMOdivgdmxJx+wF6gd+pOhLKu&#10;LDAzHQQIVjP9wKu33omC354be7Zv3Rr6AnYAAAAASUVORK5CYII=" font-family="'Dialog'" xlink:type="simple" xlink:actuate="onLoad" height="16" preserveAspectRatio="none" xlink:show="embed"/>
            <text x="719" xml:space="preserve" y="137" clip-path="url(#clipPath33)" font-family="'Dialog'" stroke="none"> + inDataSize: QuantifiedInt [1]</text>
            <image x="700" y="140" clip-path="url(#clipPath34)" width="16" xlink:href="data:image/png;base64,iVBORw0KGgoAAAANSUhEUgAAABAAAAAQCAYAAAAf8/9hAAAA3UlEQVR4Xu2OvQ4B&#10;URCF93lsRbnK1W5JSaVRUFBQ0VBRUJB4AskmJFtISMjGmwgJBY3CP8fMdQsjJJQS&#10;k3w5586cnFzD+I+aVHuCbxEFyaaPyxUfk2z5siDeGON4AeKN0Z261mdPcC5BKgpi&#10;1SG2dIhVB5ju8JYo586Uqw1lgVPuY3MCWDnIXnGW6lR0jlQU2EUPqyNglzxVsCbP&#10;b4a94nC/8y5CeVFgFXpYUMDKd2EVXhPWtyXnSEVBMOdivgdmxJx+wF6gd+pOhLKu&#10;LDAzHQQIVjP9wKu33omC354be7Zv3Rr6AnYAAAAASUVORK5CYII=" font-family="'Dialog'" xlink:type="simple" xlink:actuate="onLoad" height="16" preserveAspectRatio="none" xlink:show="embed"/>
            <text x="719" xml:space="preserve" y="153" clip-path="url(#clipPath35)" font-family="'Dialog'" stroke="none"> + outDataSize: QuantifiedInt [1]</text>
            <line y2="90" fill="none" x1="694" clip-path="url(#clipPath36)" x2="897" y1="90"/>
            <rect x="694" y="70" clip-path="url(#clipPath37)" fill="none" width="202" rx="0" ry="0" height="129"/>
            <rect x="976" y="10" clip-path="url(#clipPath38)" fill="url(#linearGradient4)" width="100" height="100" stroke="none"/>
            <image x="983" y="13" clip-path="url(#clipPath39)" width="16" xlink:href="data:image/png;base64,iVBORw0KGgoAAAANSUhEUgAAABAAAAAQCAYAAAAf8/9hAAAAsUlEQVR4XmNgoDVQ&#10;yFjwH12MJECxARQDil1AsgEFC478D2jZBsTbwbQ/mN4OpkEYJI+uBwX4N2/7//Dl&#10;F5zYr3krfgN8G7b8f/PpJ07s17gFvwE+dRv///37Dyf2rttE2ADv2g1AvPG/Vy0y&#10;G0Rv+A+SB6n7DwXo+sEGfPj6C47xgUlbL2M3AIZhABSVMAzSBMNYoxjZBeiasWF0&#10;/eB0gOwCbLbCMAig60cBIAUgTfgAANMYUHDQYIWkAAAAAElFTkSuQmCC" font-family="'Dialog'" xlink:type="simple" xlink:actuate="onLoad" height="16" preserveAspectRatio="none" xlink:show="embed"/>
            <text x="1002" xml:space="preserve" y="26" clip-path="url(#clipPath40)" font-family="'Dialog'" stroke="none">NetworkLink</text>
            <line y2="30" fill="none" x1="976" clip-path="url(#clipPath41)" x2="1076" y1="30"/>
            <rect x="976" y="10" clip-path="url(#clipPath42)" fill="none" width="99" rx="0" ry="0" height="99"/>
            <rect x="10" y="420" clip-path="url(#clipPath43)" fill="url(#linearGradient5)" width="166" height="81" stroke="none"/>
            <image x="67" y="423" clip-path="url(#clipPath44)" width="16" xlink:href="data:image/png;base64,iVBORw0KGgoAAAANSUhEUgAAABAAAAAQCAYAAAAf8/9hAAAArklEQVR4XmNggIKC&#10;BUf+B7RsA+LtYNofTG//798KpKEYJAbDIPUwvWDg37zt/8OXX4jGfs1bUQ3wbdjy&#10;/8X770Rjv8YtmAa8+fSTaIzVgA9ffxGNsRrw9ccfojGmAfWb///6/Zdo7ANUj2KA&#10;T93G/3///iMae9dtwjTAu3YDEG/871WLyoZhCB8kvuE/SD2GAegBhQ/TxgBSMYYB&#10;6Lbgw9Q3AJS70J2ID2PkRnIBAM3ojW1qXQwfAAAAAElFTkSuQmCC" font-family="'Dialog'" xlink:type="simple" xlink:actuate="onLoad" height="16" preserveAspectRatio="none" xlink:show="embed"/>
            <text x="86" xml:space="preserve" y="436" clip-path="url(#clipPath45)" font-family="'Dialog'" stroke="none">Status</text>
            <image x="16" y="442" clip-path="url(#clipPath46)" width="16" xlink:href="data:image/png;base64,iVBORw0KGgoAAAANSUhEUgAAABAAAAAQCAYAAAAf8/9hAAAA3UlEQVR4Xu2OvQ4B&#10;URCF93lsRbnK1W5JSaVRUFBQ0VBRUJB4AskmJFtISMjGmwgJBY3CP8fMdQsjJJQS&#10;k3w5586cnFzD+I+aVHuCbxEFyaaPyxUfk2z5siDeGON4AeKN0Z261mdPcC5BKgpi&#10;1SG2dIhVB5ju8JYo586Uqw1lgVPuY3MCWDnIXnGW6lR0jlQU2EUPqyNglzxVsCbP&#10;b4a94nC/8y5CeVFgFXpYUMDKd2EVXhPWtyXnSEVBMOdivgdmxJx+wF6gd+pOhLKu&#10;LDAzHQQIVjP9wKu33omC354be7Zv3Rr6AnYAAAAASUVORK5CYII=" font-family="'Dialog'" xlink:type="simple" xlink:actuate="onLoad" height="16" preserveAspectRatio="none" xlink:show="embed"/>
            <text x="35" xml:space="preserve" y="455" clip-path="url(#clipPath47)" font-family="'Dialog'" stroke="none"> + status: HealthStatus [1]</text>
            <image x="16" y="458" clip-path="url(#clipPath48)" width="16" xlink:href="data:image/png;base64,iVBORw0KGgoAAAANSUhEUgAAABAAAAAQCAYAAAAf8/9hAAAA3UlEQVR4Xu2OvQ4B&#10;URCF93lsRbnK1W5JSaVRUFBQ0VBRUJB4AskmJFtISMjGmwgJBY3CP8fMdQsjJJQS&#10;k3w5586cnFzD+I+aVHuCbxEFyaaPyxUfk2z5siDeGON4AeKN0Z261mdPcC5BKgpi&#10;1SG2dIhVB5ju8JYo586Uqw1lgVPuY3MCWDnIXnGW6lR0jlQU2EUPqyNglzxVsCbP&#10;b4a94nC/8y5CeVFgFXpYUMDKd2EVXhPWtyXnSEVBMOdivgdmxJx+wF6gd+pOhLKu&#10;LDAzHQQIVjP9wKu33omC354be7Zv3Rr6AnYAAAAASUVORK5CYII=" font-family="'Dialog'" xlink:type="simple" xlink:actuate="onLoad" height="16" preserveAspectRatio="none" xlink:show="embed"/>
            <text x="35" xml:space="preserve" y="471" clip-path="url(#clipPath49)" font-family="'Dialog'" stroke="none"> + message: String [0..1]</text>
            <line y2="440" fill="none" x1="10" clip-path="url(#clipPath50)" x2="176" y1="440"/>
            <rect x="10" y="420" clip-path="url(#clipPath51)" fill="none" width="165" rx="0" ry="0" height="80"/>
            <rect x="330" y="376" clip-path="url(#clipPath52)" fill="url(#linearGradient6)" width="202" height="134" stroke="none"/>
            <image x="397" y="379" clip-path="url(#clipPath53)" width="16" xlink:href="data:image/png;base64,iVBORw0KGgoAAAANSUhEUgAAABAAAAAQCAYAAAAf8/9hAAAArklEQVR4XmNggIKC&#10;BUf+B7RsA+LtYNofTG//798KpKEYJAbDIPUwvWDg37zt/8OXX4jGfs1bUQ3wbdjy&#10;/8X770Rjv8YtmAa8+fSTaIzVgA9ffxGNsRrw9ccfojGmAfWb///6/Zdo7ANUj2KA&#10;T93G/3///iMae9dtwjTAu3YDEG/871WLyoZhCB8kvuE/SD2GAegBhQ/TxgBSMYYB&#10;6Lbgw9Q3AJS70J2ID2PkRnIBAM3ojW1qXQwfAAAAAElFTkSuQmCC" font-family="'Dialog'" xlink:type="simple" xlink:actuate="onLoad" height="16" preserveAspectRatio="none" xlink:show="embed"/>
            <text x="416" xml:space="preserve" y="392" clip-path="url(#clipPath54)" font-family="'Dialog'" stroke="none">MSStatus</text>
            <image x="336" y="398" clip-path="url(#clipPath55)" width="16" xlink:href="data:image/png;base64,iVBORw0KGgoAAAANSUhEUgAAABAAAAAQCAYAAAAf8/9hAAAA3UlEQVR4Xu2OvQ4B&#10;URCF93lsRbnK1W5JSaVRUFBQ0VBRUJB4AskmJFtISMjGmwgJBY3CP8fMdQsjJJQS&#10;k3w5586cnFzD+I+aVHuCbxEFyaaPyxUfk2z5siDeGON4AeKN0Z261mdPcC5BKgpi&#10;1SG2dIhVB5ju8JYo586Uqw1lgVPuY3MCWDnIXnGW6lR0jlQU2EUPqyNglzxVsCbP&#10;b4a94nC/8y5CeVFgFXpYUMDKd2EVXhPWtyXnSEVBMOdivgdmxJx+wF6gd+pOhLKu&#10;LDAzHQQIVjP9wKu33omC354be7Zv3Rr6AnYAAAAASUVORK5CYII=" font-family="'Dialog'" xlink:type="simple" xlink:actuate="onLoad" height="16" preserveAspectRatio="none" xlink:show="embed"/>
            <text x="355" xml:space="preserve" y="411" clip-path="url(#clipPath56)" font-family="'Dialog'" stroke="none"> + status: HealthStatus [1]</text>
            <image x="336" y="414" clip-path="url(#clipPath57)" width="16" xlink:href="data:image/png;base64,iVBORw0KGgoAAAANSUhEUgAAABAAAAAQCAYAAAAf8/9hAAAA3UlEQVR4Xu2OvQ4B&#10;URCF93lsRbnK1W5JSaVRUFBQ0VBRUJB4AskmJFtISMjGmwgJBY3CP8fMdQsjJJQS&#10;k3w5586cnFzD+I+aVHuCbxEFyaaPyxUfk2z5siDeGON4AeKN0Z261mdPcC5BKgpi&#10;1SG2dIhVB5ju8JYo586Uqw1lgVPuY3MCWDnIXnGW6lR0jlQU2EUPqyNglzxVsCbP&#10;b4a94nC/8y5CeVFgFXpYUMDKd2EVXhPWtyXnSEVBMOdivgdmxJx+wF6gd+pOhLKu&#10;LDAzHQQIVjP9wKu33omC354be7Zv3Rr6AnYAAAAASUVORK5CYII=" font-family="'Dialog'" xlink:type="simple" xlink:actuate="onLoad" height="16" preserveAspectRatio="none" xlink:show="embed"/>
            <text x="355" xml:space="preserve" y="427" clip-path="url(#clipPath58)" font-family="'Dialog'" stroke="none"> + message: String [0..1]</text>
            <image x="336" y="430" clip-path="url(#clipPath59)" width="16" xlink:href="data:image/png;base64,iVBORw0KGgoAAAANSUhEUgAAABAAAAAQCAYAAAAf8/9hAAAA3UlEQVR4Xu2OvQ4B&#10;URCF93lsRbnK1W5JSaVRUFBQ0VBRUJB4AskmJFtISMjGmwgJBY3CP8fMdQsjJJQS&#10;k3w5586cnFzD+I+aVHuCbxEFyaaPyxUfk2z5siDeGON4AeKN0Z261mdPcC5BKgpi&#10;1SG2dIhVB5ju8JYo586Uqw1lgVPuY3MCWDnIXnGW6lR0jlQU2EUPqyNglzxVsCbP&#10;b4a94nC/8y5CeVFgFXpYUMDKd2EVXhPWtyXnSEVBMOdivgdmxJx+wF6gd+pOhLKu&#10;LDAzHQQIVjP9wKu33omC354be7Zv3Rr6AnYAAAAASUVORK5CYII=" font-family="'Dialog'" xlink:type="simple" xlink:actuate="onLoad" height="16" preserveAspectRatio="none" xlink:show="embed"/>
            <text x="355" xml:space="preserve" y="443" clip-path="url(#clipPath60)" font-family="'Dialog'" stroke="none"> + failureTolerance: String [1]</text>
            <image x="336" y="446" clip-path="url(#clipPath61)" width="16" xlink:href="data:image/png;base64,iVBORw0KGgoAAAANSUhEUgAAABAAAAAQCAYAAAAf8/9hAAAA3UlEQVR4Xu2OvQ4B&#10;URCF93lsRbnK1W5JSaVRUFBQ0VBRUJB4AskmJFtISMjGmwgJBY3CP8fMdQsjJJQS&#10;k3w5586cnFzD+I+aVHuCbxEFyaaPyxUfk2z5siDeGON4AeKN0Z261mdPcC5BKgpi&#10;1SG2dIhVB5ju8JYo586Uqw1lgVPuY3MCWDnIXnGW6lR0jlQU2EUPqyNglzxVsCbP&#10;b4a94nC/8y5CeVFgFXpYUMDKd2EVXhPWtyXnSEVBMOdivgdmxJx+wF6gd+pOhLKu&#10;LDAzHQQIVjP9wKu33omC354be7Zv3Rr6AnYAAAAASUVORK5CYII=" font-family="'Dialog'" xlink:type="simple" xlink:actuate="onLoad" height="16" preserveAspectRatio="none" xlink:show="embed"/>
            <text x="355" xml:space="preserve" y="459" clip-path="url(#clipPath62)" font-family="'Dialog'" stroke="none"> + energyExpenditure : String [1]</text>
            <image x="336" y="462" clip-path="url(#clipPath63)" width="16" xlink:href="data:image/png;base64,iVBORw0KGgoAAAANSUhEUgAAABAAAAAQCAYAAAAf8/9hAAAA3UlEQVR4Xu2OvQ4B&#10;URCF93lsRbnK1W5JSaVRUFBQ0VBRUJB4AskmJFtISMjGmwgJBY3CP8fMdQsjJJQS&#10;k3w5586cnFzD+I+aVHuCbxEFyaaPyxUfk2z5siDeGON4AeKN0Z261mdPcC5BKgpi&#10;1SG2dIhVB5ju8JYo586Uqw1lgVPuY3MCWDnIXnGW6lR0jlQU2EUPqyNglzxVsCbP&#10;b4a94nC/8y5CeVFgFXpYUMDKd2EVXhPWtyXnSEVBMOdivgdmxJx+wF6gd+pOhLKu&#10;LDAzHQQIVjP9wKu33omC354be7Zv3Rr6AnYAAAAASUVORK5CYII=" font-family="'Dialog'" xlink:type="simple" xlink:actuate="onLoad" height="16" preserveAspectRatio="none" xlink:show="embed"/>
            <text x="355" xml:space="preserve" y="475" clip-path="url(#clipPath64)" font-family="'Dialog'" stroke="none"> + podFailure: Integer [1]</text>
            <line y2="396" fill="none" x1="330" clip-path="url(#clipPath65)" x2="532" y1="396"/>
            <rect x="330" y="376" clip-path="url(#clipPath66)" fill="none" width="201" rx="0" ry="0" height="133"/>
            <rect x="676" y="420" clip-path="url(#clipPath67)" fill="url(#linearGradient7)" width="251" height="121" stroke="none"/>
            <image x="765" y="423" clip-path="url(#clipPath68)" width="16" xlink:href="data:image/png;base64,iVBORw0KGgoAAAANSUhEUgAAABAAAAAQCAYAAAAf8/9hAAAArklEQVR4XmNggIKC&#10;BUf+B7RsA+LtYNofTG//798KpKEYJAbDIPUwvWDg37zt/8OXX4jGfs1bUQ3wbdjy&#10;/8X770Rjv8YtmAa8+fSTaIzVgA9ffxGNsRrw9ccfojGmAfWb///6/Zdo7ANUj2KA&#10;T93G/3///iMae9dtwjTAu3YDEG/871WLyoZhCB8kvuE/SD2GAegBhQ/TxgBSMYYB&#10;6Lbgw9Q3AJS70J2ID2PkRnIBAM3ojW1qXQwfAAAAAElFTkSuQmCC" font-family="'Dialog'" xlink:type="simple" xlink:actuate="onLoad" height="16" preserveAspectRatio="none" xlink:show="embed"/>
            <text x="784" xml:space="preserve" y="436" clip-path="url(#clipPath69)" font-family="'Dialog'" stroke="none">Resources</text>
            <image x="682" y="442" clip-path="url(#clipPath70)" width="16" xlink:href="data:image/png;base64,iVBORw0KGgoAAAANSUhEUgAAABAAAAAQCAYAAAAf8/9hAAAA+UlEQVR4XmNgGAVg&#10;kDXr0H9SMYoBqdMO/P/77z/ROHX6AVQD4ibt+//r7///cZP2QvBEKI3OBmKQungg&#10;jWJAWM+u/9+AEmE9O/8//P4fJw4FqfsDVNe7C9UA39Zt/z/9/v8fRIMUgthg/AdB&#10;YwNwA5zrN/1/8+v/f+eGTWAD3gLZID4Ig9ggDAKsjZ5wjGKAVeX6/89//v9vVbHu&#10;v1UlKkYGII2FG0vhBoAA2ADDktX/n/z4//8xED8BugDEhmGYRhiGGQDDYAO081f8&#10;1wJiEK2dh4SBfGSb0THcAHwA3QXOc3IwXYAPwD0LNQhmAAygq8cJYAbAMAwAALEv&#10;wRlbpksiAAAAAElFTkSuQmCC" font-family="'Dialog'" xlink:type="simple" xlink:actuate="onLoad" height="16" preserveAspectRatio="none" xlink:show="embed"/>
            <text x="701" xml:space="preserve" y="455" clip-path="url(#clipPath71)" font-family="'Dialog'" stroke="none"> + cpu: QuantifiedInt [0..1]</text>
            <image x="682" y="458" clip-path="url(#clipPath72)" width="16" xlink:href="data:image/png;base64,iVBORw0KGgoAAAANSUhEUgAAABAAAAAQCAYAAAAf8/9hAAAA3UlEQVR4Xu2OvQ4B&#10;URCF93lsRbnK1W5JSaVRUFBQ0VBRUJB4AskmJFtISMjGmwgJBY3CP8fMdQsjJJQS&#10;k3w5586cnFzD+I+aVHuCbxEFyaaPyxUfk2z5siDeGON4AeKN0Z261mdPcC5BKgpi&#10;1SG2dIhVB5ju8JYo586Uqw1lgVPuY3MCWDnIXnGW6lR0jlQU2EUPqyNglzxVsCbP&#10;b4a94nC/8y5CeVFgFXpYUMDKd2EVXhPWtyXnSEVBMOdivgdmxJx+wF6gd+pOhLKu&#10;LDAzHQQIVjP9wKu33omC354be7Zv3Rr6AnYAAAAASUVORK5CYII=" font-family="'Dialog'" xlink:type="simple" xlink:actuate="onLoad" height="16" preserveAspectRatio="none" xlink:show="embed"/>
            <text x="701" xml:space="preserve" y="471" clip-path="url(#clipPath73)" font-family="'Dialog'" stroke="none"> + memory: QuantifiedInt [0..1]</text>
            <image x="682" y="474" clip-path="url(#clipPath74)" width="16" xlink:href="data:image/png;base64,iVBORw0KGgoAAAANSUhEUgAAABAAAAAQCAYAAAAf8/9hAAAA3UlEQVR4Xu2OvQ4B&#10;URCF93lsRbnK1W5JSaVRUFBQ0VBRUJB4AskmJFtISMjGmwgJBY3CP8fMdQsjJJQS&#10;k3w5586cnFzD+I+aVHuCbxEFyaaPyxUfk2z5siDeGON4AeKN0Z261mdPcC5BKgpi&#10;1SG2dIhVB5ju8JYo586Uqw1lgVPuY3MCWDnIXnGW6lR0jlQU2EUPqyNglzxVsCbP&#10;b4a94nC/8y5CeVFgFXpYUMDKd2EVXhPWtyXnSEVBMOdivgdmxJx+wF6gd+pOhLKu&#10;LDAzHQQIVjP9wKu33omC354be7Zv3Rr6AnYAAAAASUVORK5CYII=" font-family="'Dialog'" xlink:type="simple" xlink:actuate="onLoad" height="16" preserveAspectRatio="none" xlink:show="embed"/>
            <text x="701" xml:space="preserve" y="487" clip-path="url(#clipPath75)" font-family="'Dialog'" stroke="none"> + nwBandwidth: Bandwidth [0..1]</text>
            <image x="682" y="490" clip-path="url(#clipPath76)" width="16" xlink:href="data:image/png;base64,iVBORw0KGgoAAAANSUhEUgAAABAAAAAQCAYAAAAf8/9hAAAA3UlEQVR4Xu2OvQ4B&#10;URCF93lsRbnK1W5JSaVRUFBQ0VBRUJB4AskmJFtISMjGmwgJBY3CP8fMdQsjJJQS&#10;k3w5586cnFzD+I+aVHuCbxEFyaaPyxUfk2z5siDeGON4AeKN0Z261mdPcC5BKgpi&#10;1SG2dIhVB5ju8JYo586Uqw1lgVPuY3MCWDnIXnGW6lR0jlQU2EUPqyNglzxVsCbP&#10;b4a94nC/8y5CeVFgFXpYUMDKd2EVXhPWtyXnSEVBMOdivgdmxJx+wF6gd+pOhLKu&#10;LDAzHQQIVjP9wKu33omC354be7Zv3Rr6AnYAAAAASUVORK5CYII=" font-family="'Dialog'" xlink:type="simple" xlink:actuate="onLoad" height="16" preserveAspectRatio="none" xlink:show="embed"/>
            <text x="701" xml:space="preserve" y="503" clip-path="url(#clipPath77)" font-family="'Dialog'" stroke="none"> + latency: QuantifiedInt [0..1]</text>
            <image x="682" y="506" clip-path="url(#clipPath78)" width="16" xlink:href="data:image/png;base64,iVBORw0KGgoAAAANSUhEUgAAABAAAAAQCAYAAAAf8/9hAAAA3UlEQVR4Xu2OvQ4B&#10;URCF93lsRbnK1W5JSaVRUFBQ0VBRUJB4AskmJFtISMjGmwgJBY3CP8fMdQsjJJQS&#10;k3w5586cnFzD+I+aVHuCbxEFyaaPyxUfk2z5siDeGON4AeKN0Z261mdPcC5BKgpi&#10;1SG2dIhVB5ju8JYo586Uqw1lgVPuY3MCWDnIXnGW6lR0jlQU2EUPqyNglzxVsCbP&#10;b4a94nC/8y5CeVFgFXpYUMDKd2EVXhPWtyXnSEVBMOdivgdmxJx+wF6gd+pOhLKu&#10;LDAzHQQIVjP9wKu33omC354be7Zv3Rr6AnYAAAAASUVORK5CYII=" font-family="'Dialog'" xlink:type="simple" xlink:actuate="onLoad" height="16" preserveAspectRatio="none" xlink:show="embed"/>
            <text x="701" xml:space="preserve" y="519" clip-path="url(#clipPath79)" font-family="'Dialog'" stroke="none"> + energyConsumptio: QuantifiedInt [0..1]</text>
            <line y2="440" fill="none" x1="676" clip-path="url(#clipPath80)" x2="927" y1="440"/>
            <rect x="676" y="420" clip-path="url(#clipPath81)" fill="none" width="250" rx="0" ry="0" height="120"/>
            <line clip-path="url(#clipPath82)" fill="none" text-rendering="optimizeLegibility" x1="171" x2="296" y1="170" y2="170"/>
            <text x="196" y="163" clip-path="url(#clipPath83)" text-rendering="optimizeLegibility" font-family="'Dialog'" stroke="none" xml:space="preserve">DefinedBy</text>
            <text x="184" y="157" clip-path="url(#clipPath84)" text-rendering="optimizeLegibility" font-family="'Dialog'" stroke="none" xml:space="preserve">  </text>
            <text x="256" y="203" clip-path="url(#clipPath85)" text-rendering="optimizeLegibility" font-family="'Dialog'" stroke="none" xml:space="preserve">  spec</text>
            <text x="181" y="194" clip-path="url(#clipPath86)" text-rendering="optimizeLegibility" font-family="'Dialog'" stroke="none" xml:space="preserve"> 1</text>
            <text x="277" y="157" clip-path="url(#clipPath87)" text-rendering="optimizeLegibility" font-family="'Dialog'" stroke="none" xml:space="preserve"> 1</text>
            <polygon text-rendering="optimizeLegibility" clip-path="url(#clipPath88)" points=" 171 170 179 166 187 170 179 174" stroke="none"/>
            <polygon fill="none" text-rendering="optimizeLegibility" clip-path="url(#clipPath88)" points=" 171 170 179 166 187 170 179 174"/>
            <polygon text-rendering="optimizeLegibility" clip-path="url(#clipPath89)" points=" 296 171 294 173 292 173 290 171 290 170 278 176 290 170 278 164 290 170 290 169 292 167 294 167 296 169" stroke="none"/>
            <polygon fill="none" text-rendering="optimizeLegibility" clip-path="url(#clipPath89)" points=" 296 171 294 173 292 173 290 171 290 170 278 176 290 170 278 164 290 170 290 169 292 167 294 167 296 169"/>
            <line clip-path="url(#clipPath82)" fill="none" text-rendering="optimizeLegibility" x1="498" x2="694" y1="170" y2="170"/>
            <text x="549" y="163" clip-path="url(#clipPath90)" text-rendering="optimizeLegibility" font-family="'Dialog'" stroke="none" xml:space="preserve">ComposedOf</text>
            <text x="493" y="143" clip-path="url(#clipPath91)" text-rendering="optimizeLegibility" font-family="'Dialog'" stroke="none" xml:space="preserve">  </text>
            <text x="598" y="203" clip-path="url(#clipPath92)" text-rendering="optimizeLegibility" font-family="'Dialog'" stroke="none" xml:space="preserve">  microServices</text>
            <text x="510" y="183" clip-path="url(#clipPath93)" text-rendering="optimizeLegibility" font-family="'Dialog'" stroke="none" xml:space="preserve"> 1</text>
            <text x="674" y="163" clip-path="url(#clipPath94)" text-rendering="optimizeLegibility" font-family="'Dialog'" stroke="none" xml:space="preserve"> 1..*</text>
            <polygon text-rendering="optimizeLegibility" clip-path="url(#clipPath95)" points=" 498 170 506 166 514 170 506 174" stroke="none"/>
            <polygon fill="none" text-rendering="optimizeLegibility" clip-path="url(#clipPath95)" points=" 498 170 506 166 514 170 506 174"/>
            <polygon text-rendering="optimizeLegibility" clip-path="url(#clipPath96)" points=" 694 171 692 173 690 173 688 171 688 170 676 176 688 170 676 164 688 170 688 169 690 167 692 167 694 169" stroke="none"/>
            <polygon fill="none" text-rendering="optimizeLegibility" clip-path="url(#clipPath96)" points=" 694 171 692 173 690 173 688 171 688 170 676 176 688 170 676 164 688 170 688 169 690 167 692 167 694 169"/>
            <line clip-path="url(#clipPath82)" fill="none" text-rendering="optimizeLegibility" x1="897" x2="996" y1="130" y2="130"/>
            <line clip-path="url(#clipPath82)" fill="none" text-rendering="optimizeLegibility" x1="996" x2="996" y1="130" y2="230"/>
            <line clip-path="url(#clipPath82)" fill="none" text-rendering="optimizeLegibility" x1="996" x2="836" y1="230" y2="230"/>
            <line clip-path="url(#clipPath82)" fill="none" text-rendering="optimizeLegibility" x1="836" x2="836" y1="230" y2="200"/>
            <text x="836" y="223" clip-path="url(#clipPath97)" text-rendering="optimizeLegibility" font-family="'Dialog'" stroke="none" xml:space="preserve">  calls [*]</text>
            <text x="901" y="163" clip-path="url(#clipPath98)" text-rendering="optimizeLegibility" font-family="'Dialog'" stroke="none" xml:space="preserve">  calledBy [1..*]</text>
            <polygon text-rendering="optimizeLegibility" clip-path="url(#clipPath99)" points=" 897 129 899 127 901 127 903 129 903 130 915 124 903 130 915 136 903 130 903 131 901 133 899 133 897 131" stroke="none"/>
            <polygon fill="none" text-rendering="optimizeLegibility" clip-path="url(#clipPath99)" points=" 897 129 899 127 901 127 903 129 903 130 915 124 903 130 915 136 903 130 903 131 901 133 899 133 897 131"/>
            <line clip-path="url(#clipPath82)" fill="none" text-rendering="optimizeLegibility" x1="958" x2="976" y1="130" y2="110" stroke-dasharray="6.6,3.3"/>
            <line clip-path="url(#clipPath82)" fill="none" text-rendering="optimizeLegibility" x1="96" x2="96" y1="191" y2="420"/>
            <text x="131" y="216" clip-path="url(#clipPath100)" text-rendering="optimizeLegibility" font-family="'Dialog'" stroke="none" xml:space="preserve"> </text>
            <text x="36" y="403" clip-path="url(#clipPath101)" text-rendering="optimizeLegibility" font-family="'Dialog'" stroke="none" xml:space="preserve">  status</text>
            <text x="76" y="203" clip-path="url(#clipPath102)" text-rendering="optimizeLegibility" font-family="'Dialog'" stroke="none" xml:space="preserve"> 1</text>
            <text x="116" y="403" clip-path="url(#clipPath103)" text-rendering="optimizeLegibility" font-family="'Dialog'" stroke="none" xml:space="preserve"> 0..1</text>
            <polygon text-rendering="optimizeLegibility" clip-path="url(#clipPath104)" points=" 95 420 93 418 93 416 95 414 96 414 90 402 96 414 102 402 96 414 97 414 99 416 99 418 97 420" stroke="none"/>
            <polygon fill="none" text-rendering="optimizeLegibility" clip-path="url(#clipPath104)" points=" 95 420 93 418 93 416 95 414 96 414 90 402 96 414 102 402 96 414 97 414 99 416 99 418 97 420"/>
            <line clip-path="url(#clipPath82)" fill="none" text-rendering="optimizeLegibility" x1="176" x2="256" y1="470" y2="470"/>
            <line clip-path="url(#clipPath82)" fill="none" text-rendering="optimizeLegibility" x1="256" x2="330" y1="470" y2="470"/>
            <text x="210" y="463" clip-path="url(#clipPath105)" text-rendering="optimizeLegibility" font-family="'Dialog'" stroke="none" xml:space="preserve">Aggregates</text>
            <text x="198" y="456" clip-path="url(#clipPath106)" text-rendering="optimizeLegibility" font-family="'Dialog'" stroke="none" xml:space="preserve"> </text>
            <text x="253" y="483" clip-path="url(#clipPath107)" text-rendering="optimizeLegibility" font-family="'Dialog'" stroke="none" xml:space="preserve">  msstatus</text>
            <text x="195" y="496" clip-path="url(#clipPath108)" text-rendering="optimizeLegibility" font-family="'Dialog'" stroke="none" xml:space="preserve"> 1</text>
            <text x="296" y="456" clip-path="url(#clipPath109)" text-rendering="optimizeLegibility" font-family="'Dialog'" stroke="none" xml:space="preserve"> 1..*</text>
            <polygon text-rendering="optimizeLegibility" clip-path="url(#clipPath110)" points=" 176 470 184 466 192 470 184 474" stroke="none"/>
            <polygon fill="none" text-rendering="optimizeLegibility" clip-path="url(#clipPath110)" points=" 176 470 184 466 192 470 184 474"/>
            <polygon text-rendering="optimizeLegibility" clip-path="url(#clipPath111)" points=" 330 471 328 473 326 473 324 471 324 470 312 476 324 470 312 464 324 470 324 469 326 467 328 467 330 469" stroke="none"/>
            <polygon fill="none" text-rendering="optimizeLegibility" clip-path="url(#clipPath111)" points=" 330 471 328 473 326 473 324 471 324 470 312 476 324 470 312 464 324 470 324 469 326 467 328 467 330 469"/>
            <line clip-path="url(#clipPath82)" fill="none" text-rendering="optimizeLegibility" x1="796" x2="796" y1="200" y2="420"/>
            <text x="775" y="303" clip-path="url(#clipPath112)" text-rendering="optimizeLegibility" font-family="'Dialog'" stroke="none" xml:space="preserve">MaximalUsed </text>
            <text x="815" y="240" clip-path="url(#clipPath113)" text-rendering="optimizeLegibility" font-family="'Dialog'" stroke="none" xml:space="preserve"> </text>
            <text x="791" y="383" clip-path="url(#clipPath114)" text-rendering="optimizeLegibility" font-family="'Dialog'" stroke="none" xml:space="preserve">  maxRequired</text>
            <text x="796" y="223" clip-path="url(#clipPath115)" text-rendering="optimizeLegibility" font-family="'Dialog'" stroke="none" xml:space="preserve"> 1</text>
            <text x="802" y="403" clip-path="url(#clipPath116)" text-rendering="optimizeLegibility" font-family="'Dialog'" stroke="none" xml:space="preserve"> 1</text>
            <polygon text-rendering="optimizeLegibility" clip-path="url(#clipPath117)" points=" 796 200 800 208 796 216 792 208" stroke="none"/>
            <polygon fill="none" text-rendering="optimizeLegibility" clip-path="url(#clipPath117)" points=" 796 200 800 208 796 216 792 208"/>
            <polygon text-rendering="optimizeLegibility" clip-path="url(#clipPath118)" points=" 795 420 793 418 793 416 795 414 796 414 790 402 796 414 802 402 796 414 797 414 799 416 799 418 797 420" stroke="none"/>
            <polygon fill="none" text-rendering="optimizeLegibility" clip-path="url(#clipPath118)" points=" 795 420 793 418 793 416 795 414 796 414 790 402 796 414 802 402 796 414 797 414 799 416 799 418 797 420"/>
            <line clip-path="url(#clipPath82)" fill="none" text-rendering="optimizeLegibility" x1="532" x2="676" y1="470" y2="470"/>
            <text x="574" y="464" clip-path="url(#clipPath119)" text-rendering="optimizeLegibility" font-family="'Dialog'" stroke="none" xml:space="preserve">AvgUsed</text>
            <text x="555" y="458" clip-path="url(#clipPath120)" text-rendering="optimizeLegibility" font-family="'Dialog'" stroke="none" xml:space="preserve"> </text>
            <text x="579" y="502" clip-path="url(#clipPath121)" text-rendering="optimizeLegibility" font-family="'Dialog'" stroke="none" xml:space="preserve">  usedResources</text>
            <text x="552" y="495" clip-path="url(#clipPath122)" text-rendering="optimizeLegibility" font-family="'Dialog'" stroke="none" xml:space="preserve"> 1</text>
            <text x="647" y="458" clip-path="url(#clipPath123)" text-rendering="optimizeLegibility" font-family="'Dialog'" stroke="none" xml:space="preserve"> 1</text>
            <polygon text-rendering="optimizeLegibility" clip-path="url(#clipPath124)" points=" 532 470 540 466 548 470 540 474" stroke="none"/>
            <polygon fill="none" text-rendering="optimizeLegibility" clip-path="url(#clipPath124)" points=" 532 470 540 466 548 470 540 474"/>
            <polygon text-rendering="optimizeLegibility" clip-path="url(#clipPath125)" points=" 676 471 674 473 672 473 670 471 670 470 658 476 670 470 658 464 670 470 670 469 672 467 674 467 676 469" stroke="none"/>
            <polygon fill="none" text-rendering="optimizeLegibility" clip-path="url(#clipPath125)" points=" 676 471 674 473 672 473 670 471 670 470 658 476 670 470 658 464 670 470 670 469 672 467 674 467 676 469"/>
            <line clip-path="url(#clipPath82)" fill="none" text-rendering="optimizeLegibility" x1="716" x2="716" y1="200" y2="420"/>
            <text x="662" y="315" clip-path="url(#clipPath126)" text-rendering="optimizeLegibility" font-family="'Dialog'" stroke="none" xml:space="preserve">MinimalUsed </text>
            <text x="697" y="239" clip-path="url(#clipPath127)" text-rendering="optimizeLegibility" font-family="'Dialog'" stroke="none" xml:space="preserve"> </text>
            <text x="632" y="384" clip-path="url(#clipPath128)" text-rendering="optimizeLegibility" font-family="'Dialog'" stroke="none" xml:space="preserve">  minReauired</text>
            <text x="700" y="188" clip-path="url(#clipPath129)" text-rendering="optimizeLegibility" font-family="'Dialog'" stroke="none" xml:space="preserve"> 1</text>
            <text x="686" y="393" clip-path="url(#clipPath130)" text-rendering="optimizeLegibility" font-family="'Dialog'" stroke="none" xml:space="preserve"> 0..1</text>
            <polygon text-rendering="optimizeLegibility" clip-path="url(#clipPath131)" points=" 716 200 720 208 716 216 712 208" stroke="none"/>
            <polygon fill="none" text-rendering="optimizeLegibility" clip-path="url(#clipPath131)" points=" 716 200 720 208 716 216 712 208"/>
            <polygon text-rendering="optimizeLegibility" clip-path="url(#clipPath132)" points=" 715 420 713 418 713 416 715 414 716 414 710 402 716 414 722 402 716 414 717 414 719 416 719 418 717 420" stroke="none"/>
            <polygon fill="none" text-rendering="optimizeLegibility" clip-path="url(#clipPath132)" points=" 715 420 713 418 713 416 715 414 716 414 710 402 716 414 722 402 716 414 717 414 719 416 719 418 717 420"/>
        </g>
    </g>
    <rect x="16" y="130" fill-opacity="0" width="155" id="Application" height="61" stroke-opacity="0"/>
    <rect x="22" y="152" fill-opacity="0" width="145" id="apiVersion" height="16" stroke-opacity="0"/>
    <rect x="296" y="90" fill-opacity="0" width="202" id="Spec" height="162" stroke-opacity="0"/>
    <rect x="302" y="112" fill-opacity="0" width="192" id="name" height="16" stroke-opacity="0"/>
    <rect x="302" y="128" fill-opacity="0" width="192" id="qos" height="16" stroke-opacity="0"/>
    <rect x="302" y="144" fill-opacity="0" width="192" id="compliance" height="16" stroke-opacity="0"/>
    <rect x="302" y="160" fill-opacity="0" width="192" id="failureTolerance" height="16" stroke-opacity="0"/>
    <rect x="302" y="176" fill-opacity="0" width="192" id="energyExpenditure " height="16" stroke-opacity="0"/>
    <rect x="302" y="192" fill-opacity="0" width="192" id="securityLevel" height="16" stroke-opacity="0"/>
    <rect x="694" y="70" fill-opacity="0" width="203" id="MSSpec" height="130" stroke-opacity="0"/>
    <rect x="700" y="92" fill-opacity="0" width="193" id="name" height="16" stroke-opacity="0"/>
    <rect x="700" y="108" fill-opacity="0" width="193" id="podSpecName" height="16" stroke-opacity="0"/>
    <rect x="700" y="124" fill-opacity="0" width="193" id="inDataSize" height="16" stroke-opacity="0"/>
    <rect x="700" y="140" fill-opacity="0" width="193" id="outDataSize" height="16" stroke-opacity="0"/>
    <rect x="976" y="10" fill-opacity="0" width="100" id="NetworkLink" height="100" stroke-opacity="0"/>
    <rect x="10" y="420" fill-opacity="0" width="166" id="Status" height="81" stroke-opacity="0"/>
    <rect x="16" y="442" fill-opacity="0" width="156" id="status" height="16" stroke-opacity="0"/>
    <rect x="16" y="458" fill-opacity="0" width="156" id="message" height="16" stroke-opacity="0"/>
    <rect x="330" y="376" fill-opacity="0" width="202" id="MSStatus" height="134" stroke-opacity="0"/>
    <rect x="336" y="398" fill-opacity="0" width="192" id="status" height="16" stroke-opacity="0"/>
    <rect x="336" y="414" fill-opacity="0" width="192" id="message" height="16" stroke-opacity="0"/>
    <rect x="336" y="430" fill-opacity="0" width="192" id="failureTolerance" height="16" stroke-opacity="0"/>
    <rect x="336" y="446" fill-opacity="0" width="192" id="energyExpenditure " height="16" stroke-opacity="0"/>
    <rect x="336" y="462" fill-opacity="0" width="192" id="podFailure" height="16" stroke-opacity="0"/>
    <rect x="676" y="420" fill-opacity="0" width="251" id="Resources" height="121" stroke-opacity="0"/>
    <rect x="682" y="442" fill-opacity="0" width="241" id="cpu" height="16" stroke-opacity="0"/>
    <rect x="682" y="458" fill-opacity="0" width="241" id="memory" height="16" stroke-opacity="0"/>
    <rect x="682" y="474" fill-opacity="0" width="241" id="nwBandwidth" height="16" stroke-opacity="0"/>
    <rect x="682" y="490" fill-opacity="0" width="241" id="latency" height="16" stroke-opacity="0"/>
    <rect x="682" y="506" fill-opacity="0" width="241" id="energyConsumptio" height="16" stroke-opacity="0"/>
</svg>
